Ontologia de biografias parlamentarias
type: Ontology
comment: Esta ontologia modela en rdfs y owl clases y relaciones en el dominio de biografias de parlamentarios.
comment: This ontology allow modeling, using RDFs and OWL, relations in the domain of parliamentary biographies. @en
label: Parliamentary biographies ontology @en
imports: bcn-congress.rdf
imports: bcn-resources.rdf
imports: http://purl.org/dc/elements/1.1/
imports: .rdf
imports: time#
imports: org.rdf
imports: 20100809.rdf
prior version: bcn-biographies.rdf
version info: 1.3

Alcalde
type: Class
comment: Autoridad máxima de una comuna.
subclass of: Cargo público

Candidato
type: Class
comment: A politician that wants be elected. @en
comment: Un politico que quiere ser electo.
label: Candidate @en
subclass of: Rol

Cargo
type: Class
comment: Investidura o nombramiento que se otorga a una persona. Dignidad, empleo u oficio. Una persona puede ser |nombrada en uno o más cargos.

Cargo público
type: Class
subclass of: Cargo

Coalición
type: Class
comment: Coalición o grupo de partidos políticos unidos.

Concejal
type: Class
comment: Autoridad municipal perteneciente al concejo municipal.
subclass of: Cargo público

Consejero
type: Class
subclass of: Cargo público

Diputado
type: Class
comment: A parlamentary that is deputy. @en
comment: Un Parlamentario que es diputado.
label: Deputy @en
subclass of: Cargo público
subclass of: Parlamentario

Director
type: Class
subclass of: Cargo

Elección
type: Class
comment: Designación, que regularmente se hace por votos, para algún cargo, comisión, etc.
subclass of: Evento

Intendente
type: Class
comment: Máxima autoridad provincial regional, representante del poder ejecutivo.
subclass of: Cargo público

Ministro
type: Class
comment: Persona que dirige cada uno de los departamentos ministeriales en que se divide la gobernación del Estado
subclass of: Cargo público

Ministro de Agricultura
type: Class
subclass of: Ministro

Ministro de Defensa Nacional
type: Class
subclass of: Ministro

Ministro de Economía, Fomento y Turismo
type: Class
subclass of: Ministro

Ministro de Educación
type: Class
subclass of: Ministro

Ministro de Energía
type: Class
subclass of: Ministro

Ministro de Guerra
type: Class
subclass of: Ministro
equivalent class: Ministro de Defensa Nacional

Ministro de Hacienda
type: Class
subclass of: Ministro

Ministros de Industria, Obras Públicas y Ferrocarriles
type: Class
subclass of: Ministro
equivalent class: Ministro de Obras Públicas

Ministro del Interior y Seguridad Pública
type: Class
subclass of: Ministro

Ministro de Justicia
type: Class
subclass of: Ministro

Ministro de Minería
type: Class
subclass of: Ministro

Ministro de Obras Públicas
type: Class
subclass of: Ministro

Ministro de Relaciones Exteriores
type: Class
subclass of: Ministro

Ministro de Salubridad
type: Class
subclass of: Ministro

Ministro Secretario General de Gobierno
type: Class
subclass of: Ministro

Ministro del Trabajo y Previsión Social
type: Class
subclass of: Ministro

Parlamentario
type: Class
comment: A person that is parlamentary. @en
comment: Una persona que es parlamentario.
label: Parliamentary @en

Periodo parlamentario
type: Class
comment: Define un periodo temporal para un parlamentario
comment: Defines a temporal period for a parliamentary @en
label: Parliamentary period @en
subclass of: Periodo en cargo

Plenipotenciario
type: Class
comment: Dicho de una persona: Enviada por los reyes y las repúblicas a los congresos o a otros Estados, con el pleno poder y facultad de tratar, concluir y ajustar las paces u otros intereses.
subclass of: Cargo público

Partido político
type: Class
comment: Define un partido politico al que puede pertenecer una persona
comment: Defines a political party, which can belong a person @en
label: Political party @en
subclass of: FormalOrganization

Periodo en cargo
type: Class

Presidente de la camara de diputados
type: Class
comment: A Deputy that is president of house of representatives. @en
comment: Un diputado que es presidente de la camara de diputados.
label: President of House of representatives @en
subclass of: Diputado

Presidente de la Republica
type: Class
comment: A politician that is president of the republic (of a country). @en
comment: Un politico que es presidente de la republica (de un pais).
label: President of Republic @en
subclass of: Cargo público

Presidente del Senado.
type: Class
comment: A senator that is president of Senate. @en
comment: Un senador que es presidente del Senado.
label: President of Senate @en
subclass of: Senador

Regidor
type: Class
subclass of: Cargo público

Rol
comment: Función que alguien o algo cumple en algún momento.
comment: Función que toma una persona en un determinado instante, y que participa en las sesiones de sala o comisión, independiente de su cargo. Es un atributo circunstancial y puede coincidir con el cargo de la persona.

Senador
type: Class
comment: A parlamentary that is Senator. @en
comment: Un parlamentario que es senador.
label: Senator @en
subclass of: Cargo público
subclass of: Parlamentario

página BCN
type: ObjectProperty
comment: Enlaza un recurso con su página Web correspondiente en el sitio de la BCN
domain: Thing
range: Document

elección a la que pertenece
type: ObjectProperty
domain: Candidato
range: Elección
inverse of: tiene candidato

candidatura de
type: ObjectProperty
comment: Establece la entidad a al cual pertenece la candidatura
domain: Candidato
range: Agent
inverse of: tiene candidatura

compuesto por
type: ObjectProperty
comment: Utilizada para modelar las coaliciones de partidos
domain: Partido político
range: Partido político

tiene acrónimo
type: DatatypeProperty
comment: representa una sigla asociada a un recurso
range: string

tiene inicio
type: ObjectProperty
domain: Periodo en cargo
range: DateTimeDescription
sub property of: hasBeginning

Ha nacido
type: Property
type: ObjectProperty
comment: relaciona a una persona con los datos de su nacimiento
comment: relates a person with their birth data @en
domain: Person
label: Has born @en
range: Birth
sub property of: event

tiene candidato
type: ObjectProperty
domain: Elección
range: Candidato

tiene candidatura
type: ObjectProperty
comment: tiene candidatura permite determinar un candidato para una elección particular.
domain: Agent
range: Candidato

Ha muerto
type: Property
type: ObjectProperty
comment: Indica los datos de una persona cuando ha muerto.
comment: Indicates the data of a person when has died. @en
domain: Person
label: Has died @en
range: Death
sub property of: event

tiene candidato electo
type: ObjectProperty
comment: Representa al ganador de la elección.
domain: Elección
range: Candidato

tiene fin
type: ObjectProperty
domain: Periodo en cargo
range: DateTimeDescription
sub property of: hasEnd

tiene fecha de fundacion
type: Property
type: ObjectProperty
comment: Define la fecha de fundacion de un partido politico
domain: Partido político
label: has foundation date @en
range: DateTimeDescription

tiene fundador
type: DatatypeProperty
comment: corresponde a una propiedad generica para definir un fundador de partido politico
domain: Partido político
label: has founder @en
range: string

tiene datos históricos
type: ObjectProperty
domain: Class
  union of: Agent
  union of: Organization
range: Instant

tiene nombramiento parlamentario
type: Property
type: ObjectProperty
comment: Relaciona un parlamentario con un periodo.
comment: Relates a parlamentary with a parlamentary period. @en
label: has parliamentary appointment. @en
sub property of: tiene cargo por periodo

tiene fundador parlamentario
type: Property
type: ObjectProperty
comment: Describe una relacion entre un parlamentario y un partido politico, en donde el parlamentario es fundador del partido.
domain: Partido político
label: has parliamentary founder @en
range: Person

tiene representación parlamentaria en
type: Property
comment: Indica un lugar en el cual un parlamentario ha sido elegido, o el lugar en donde un partido político ha obtenido una representación parlamentaria
domain: Class
  union of: Parlamentario
  union of: Partido político

tiene periodo
type: ObjectProperty
domain: Periodo en cargo
range: Interval

has political party
type: Property
type: ObjectProperty
comment: Relaciona un periodo parlamentario con un partido politico.
comment: Relates a parlamentary period with a political party. @en
domain: Thing
label: tiene partido politico
range: Partido político

tiene partido politico como referencia
type: Property
type: ObjectProperty
comment: Describe una relacion en donde un partido politico tiene a otro partido politico como referencia.
domain: Partido político
label: has political party as referring @en
range: Partido político

tiene cargo
type: ObjectProperty
domain: Class
  union of: Periodo en cargo
  union of: Elección
range: Cargo público

tiene cargo por periodo
type: ObjectProperty
domain: Person
range: Periodo en cargo

tiene cargo público
type: ObjectProperty
sub property of: tiene cargo por periodo

tiene referente
type: Property
type: ObjectProperty
comment: Define que algo tiene como referente a otra cosa.
domain: Partido político
label: has referring @en

tiene representación en
type: DatatypeProperty
comment: referencia al label de una división electoral del país
domain: Partido político
range: string

representa a un partido político llamado
type: DatatypeProperty
domain: Periodo parlamentario
range: string

fecha original
type: DatatypeProperty
domain: DateTimeDescription
range: string

es parte de
type: ObjectProperty
domain: Cargo
range: FormalOrganization

periodo a ejercer
type: ObjectProperty
domain: Elección
range: Interval

profesión
type: DatatypeProperty
comment: La profesion de una persona
comment: The profession of a person @en
domain: Person
label: profession @en
range: string

religión
type: DatatypeProperty
comment: La creencia religiosa de una persona
comment: The religious belief of a person @en
domain: Person
label: religion @en
range: string

es representado por
type: ObjectProperty
domain: Partido político
range: Person

representa a
type: ObjectProperty
domain: Periodo parlamentario

representando a un lugar llamado
type: DatatypeProperty
domain: Periodo parlamentario
range: string

total votos
type: DatatypeProperty
comment: Número total de votos que se obtuvieron, ya sea para un candidato como para una elección, según dependa el caso.
domain: Class
  union of: Elección
  union of: Candidato
range: long

usado por
type: ObjectProperty
domain: Cargo
range: Periodo en cargo