Circunscripcion
type: Class
comment: Division politica geografica utilizada para la eleccion senatorial.
label: Circumscription @en
label: Circunscripción
subclass of: Lugar electoral

Comuna
type: Class
comment: Es el territorio legalmente definido para fines deAdministración Local en que se divide la provincia. Constituye el nivel básico de la estructuración del Estado. Su autoridadjurisdiccional es la Municipalidad, cuya sede es determinada por la Ley.
label: Commune @en
subclass of: División territorial

País
type: Class
comment: La descripcion de un pais a nivel geografico.
label: Country @en
subclass of: Lugar geográfico
subclass of: Feature
equivalent class: Country

Distrito
type: Class
comment: Una division geografica utilizada para elección de diputados.
label: District @en
subclass of: Lugar electoral

División territorial
type: Class
subclass of: Lugar geográfico

Lugar electoral
type: Class
comment: Define un lugar geografico definido para realizar elecciones.
label: Electoral place @en
subclass of: Lugar

Ontologia geografica
type: Ontology
comment: Esta ontología es unmodelo geografico adaptado a la realidad chilena.
label: Geographic ontology @en
imports: ontology v3.1.rdf
version info: 1.2 - 2012-12-06

Lugar geográfico
type: Class
comment: Define la estructura basica de un lugar geografico.
label: Geographical place @en
subclass of: Lugar

Lugar
type: Class
comment: Algo que pueda ser definido como un lugar, ya sea desde el punto de vista geografico, politico electoral u otro.
comment: Some that may be defined as a place, either from diferent view points: geographic, politic electoral or other. @en
label: Place @en
subclass of: Place
subclass of: SpatialThing

Provincia
type: Class
comment: Es el territorio legalmente definido para fines de Gobierno y Administración Interior, en que se divide la Región, constituyendo el segundo nivel de estructuración del país para este efecto. Se conforma por Comunas y debe contar con una capital que constituye la sede de su autoridad, el Gobernador, y de la demás institucionalidad propia de esta unidad territorial
label: Province @en
subclass of: División territorial

Región
type: Class
comment: Es el territorio jurídicamente determinado para fines de Gobierno y Administración Interior y Descentralizada del Estado, que constituye el primer nivel de estructuración del país, para dicho efecto. Se divide en Provincias y debe contar con una ciudad capital, que constituye la sede de su autoridad (Intendente y Gobierno Regional) y de la demás institucionalidad propia de esta unidad territorial.
label: Region @en
subclass of: División territorial

parte de
type: Property
type: ObjectProperty
comment: Define una relacion entre un lugar geografico y las divisiones que pueden realizarse sobre el
domain: División territorial
label: divided into @en
label: es de
label: esta dentro de
label: pertenece a
range: Lugar

compuesto por
type: Property
type: ObjectProperty
comment: Propiedad que define una relacion entre una division geografica y un lugar
domain: Lugar
label: composed by @en
label: se divide en
range: División territorial

tiene Codigo Unico Territorial
type: Property
type: DatatypeProperty
comment: Es un número de identificación único para cada unidad territorial de la División PolíticoAdministrativa. Se representa con números arábigos y corresponde a dos dígitos para identificar la región, uno para la provincia y dos para la comuna, quedando esta última con 5 dígitos.Los códigos utilizados a niveles regional, provincial y comunal,han sido establecidos oficialmente mediante el decreto N° 1.439del Ministerio del Interior, en el Diario Oficial N° 36.657 del 8 deMayo de 2000 y posteriormente modificado por los decretos N°1.352 del año 2.004 y N° 910 del 2.007.
domain: División territorial
label: has code @en
range: integer

Area
type: Clase
comment: Corresponde a cualquier area geografica
comment: country, state, region ... @en

first-order administrative division
type: Codigo
definition: a primary administrative division of a country, such as a state in the United States @en
in scheme: Area

second-order administrative division
type: Codigo
definition: a subdivision of a first-order administrative division @en
in scheme: Area

third-order administrative division
type: Codigo
definition: a subdivision of a second-order administrative division @en
in scheme: Area

fourth-order administrative division
type: Codigo
definition: a subdivision of a third-order administrative division @en
in scheme: Area

administrative division
type: Codigo
definition: an administrative division of a country, undifferentiated as to administrative level @en
in scheme: Area

Clase
type: Class
comment: A class of features. @en
comment: Una clase en el modelo geonames
label: Class @en
subclass of: ConceptScheme

Codigo
type: Class
comment: A feature code.
comment: Un codigo de caracteristica.
label: Code @en
subclass of: Concept

nombre
type: Property
type: DatatypeProperty
domain: Lugar
label: nombre oficial
range: string

latitud
type: Property
type: DatatypeProperty
domain: Lugar geográfico
label: latitude @en
range: double

longitud
type: Property
type: DatatypeProperty
domain: Lugar geográfico
label: longitude @en
range: double