Ontología Reportes Comunales
type: Ontology
version info: 1.1
comment: Ontología de Reportes Comunales de SIIT.
imports: bcn-geographics#
imports: http://purl.org/dc/elements/1.1/
imports: time

Variable estudiantes PSU sobre 450
type: Class
subclass of: Variables Dimensión Educacional
comment: Indica porcentaje de postulantes con resultados PSU sobre 450 puntos.

Variable Calidad Viviendas aceptables
type: Class
subclass of: Variables Dimensión Social
comment: Indica número y porcentaje de las viviendas en estado aceptable. El Indice de Calidad Global de la Vivienda, que diferencia el parque de viviendas en Viviendas de calidad Aceptable, Recuperable e Irrecuperables, clasifica como Aceptables las viviendas con materialidad, saneamiento y de tipo aceptables.

Variable Calidad Viviendas irrecuperables
type: Class
subclass of: Variables Dimensión Social
comment: Indica número y porcentaje de las viviendas en estado irrecuperable. Las viviendas Irrecuperables corresponden a las viviendas con materialidad irrecuperable o tipo irrecuperable (independiente del saneamiento). Se considera como irrecuperables todas las viviendas del tipo mediagua, aun cuando su saneamiento o materialidad sean aceptables o recuperables.

Variable Calidad Viviendas recuperables
type: Class
subclass of: Variables Dimensión Social
comment: Indica número y porcentaje de las viviendas en estado recuperable. El Indice de Calidad Global de la Vivienda, que diferencia el parque de viviendas en Viviendas de calidad Aceptable, Recuperable e Irrecuperables, clasifica como Recuperables las viviendas con saneamiento deficitario o materialidad recuperables, siempre y cuando el tipo de vivienda no sea irrecuperable.

Variable Centros adultos mayores
type: Class
subclass of: Variables Dimensión Municipalidad
comment: Indica número de centros de adultos mayores.

Variable Centros apoderados
type: Class
subclass of: Variables Dimensión Municipalidad
comment: Indica número de centros de apoderados.

Variable Centros de madres
type: Class
subclass of: Variables Dimensión Municipalidad
comment: Indica número de centros de madres.

Variable Clubes deportivos
type: Class
subclass of: Variables Dimensión Municipalidad
comment: Indica número de clubes deportivos.

Variable Delitos mayor connotación
type: Class
subclass of: Variables Dimensión Seguridad Ciudadana
comment: Indica cantidad de denuncias de los delitos de robo con violencia, robo con intimidación, robo por sorpresa, robo con fuerza, robo de vehículos, robo en lugar habitado, robo en lugar no habitado, hurto, lesiones, homicidio y violación por cada 100 mil habitantes.

Variable Delitos violencia familiar
type: Class
subclass of: Variables Dimensión Seguridad Ciudadana
comment: Indica cantidad de denuncias de delitos de violencia intrafamiliar por cada 100 mil habitantes.

Variable Deuda educación
type: Class
subclass of: Variables Dimensión Municipalidad
comment: Indica la deuda flotante del ámbito educación.

Variable Deuda municipal
type: Class
subclass of: Variables Dimensión Municipalidad
comment: Indica la deuda flotante municipal. Deuda Flotante sector Municipal corresponde a los compromisos devengados y no pagados al 31 de diciembre del ejercicio presupuestario, en conformidad a lo dispuesto en los artículos N° 12 y N° 19 del D.L. N° 1.263 de 1975. Indicador creado en el año 2008, por cambio del Clasificador Presupuestario. La Deuda Flotante (cuenta 215.34.07.000.000 del Clasificador Presupuestario) de la Ejecución Presupuestaria no es deuda acumulada ni vencida del municipio, sino que es la diferencia, al cierre de ejercicio, entre el total de gastos devengados en el ejercicio y el total de pagos correspondientes a esos gastos. Es decir el total de gastos devengados durante el ejercicio, que al cierre del mismo se encuentran impagos. Representa un monto global de deudas hacia terceros por montos ciertos.

Variable Deuda salud
type: Class
subclass of: Variables Dimensión Municipalidad
comment: Indica la deuda flotante.

Dimensión
type: Class
comment: Conjunto de variables e indicadores que permiten caraterizar a la población comunal.

Dimensión demográfica
type: Class
subclass of: Dimensión
comment: Conjunto de variables e indicadores que permiten caracterizar a la población desde la perspectiva demográfica

Dimensión económica
type: Class
subclass of: Dimensión
comment: Conjunto de variables e indicadores que permiten caracterizar a la población desde la perspectiva económica.

Dimensión educacional
type: Class
subclass of: Dimensión
comment: Conjunto de variables e indicadores que permiten caracterizar a la población desde la perspectiva educacional.

Dimensión municipalidad
type: Class
subclass of: Dimensión
comment: Conjunto de variables e indicadores que permiten caracterizar a la población desde la perspectiva de la administración municipal.

Dimensión salud
type: Class
subclass of: Dimensión
comment: Conjunto de variables e indicadores que permiten caracterizar a la población desde la perspectiva de la salud

Dimensión seguridad ciudadana
type: Class
subclass of: Dimensión
comment: Conjunto de variables e indicadores que permiten caracterizar a la población desde la perspectiva de la seguridad ciudadana

Dimensión social
type: Class
subclass of: Dimensión
comment: Conjunto de variables e indicadores que permiten caracterizar a la población desde la perspectiva de la realidad social

Variable Disponibilidad Presupuesto por habitante
type: Class
subclass of: Variables Dimensión Municipalidad
comment: Indica el monto del presupuesto municipal disponible por habitante (en miles de pesos).

VariableEmpleados permanentes hombres silvoagropecuarios
type: Class
subclass of: Variables Dimensión Económica
comment: Indica número de hombres empleados de forma permanente en el sector silvoagropecuario.

Variable Empleadas permanentes mujeres silvoagropecuarias
type: Class
subclass of: Variables Dimensión Económica
comment: Indica el número de mujeres empleadas de forma permanente, en el sector silvoagropecuario.

Variable Empresas Adminsitración Pública
type: Class
subclass of: Variables Dimensión Económica
comment: Indica el número de empresas de la adminstración pública y defensa, planes de seguridad social de afiliación obligatoria.

Variable Empresas agrícolas
type: Class
subclass of: Variables Dimensión Económica
comment: Indica número de empresas de la rama de la agricultura, ganadería, caza y silvicultua.

Variable Empresas comercio mayor y menor
type: Class
subclass of: Variables Dimensión Económica
comment: Indica número de empresas de la rama del comercio al por mayor y menor, repuestos, vehículos, automotores/enseres domésticos.

VariableEmpresas administración edificios
type: Class
subclass of: Variables Dimensión Económica
comment: Indica número de empresas de consejo de administración de edificios.

Variable Empresas construcción
type: Class
subclass of: Variables Dimensión Económica
comment: Indica número de empresas de la rama de la construcción.

Variable Empresas enseñanza
type: Class
subclass of: Variables Dimensión Económica
comment: Indica número de empresas de la rama de la enseñanza.

Variable Empresas grandes
type: Class
subclass of: Variables Dimensión Económica
comment: Indica número de emrpesas con ventas anuales de 100.000,01 UF a más de 1.000.000 UF.

Variable Empresas hoteles restaurantes
type: Class
subclass of: Variables Dimensión Económica
comment: Indica número de empresas de la rama de hoteles y restaurantes.

VariableEmpresas inmobiliarias
type: Class
subclass of: Variables Dimensión Económica
comment: Indica el número de emrpesas inmobiliarias.

Variable Empresas intermediación financiera
type: Class
subclass of: Variables Dimensión Económica
comment: Indica número de empresas de intermediación financiera.

Variable Empresas manufactureras metálicas
type: Class
subclass of: Variables Dimensión Económica
comment: Indica número de empresas manufactureras metálicas

Variable Empresas manufactureras no metálicas
type: Class
subclass of: Variables Dimensión Económica
comment: Indica número de empresas manufactureras no metálicas.

Variable Empresas medianas
type: Class
subclass of: Variables Dimensión Económica
comment: Indica número de empresas con ventas anuales de 25.000,01 UF a 100.000 UF.

Variable Órganos extraterritoriales
type: Class
subclass of: Variables Dimensión Económica
comment: Indica número de organizaciones y órganos extraterritoriales.

Variable Servicios comunitarios
type: Class
subclass of: Variables Dimensión Económica
comment: Indica en número de entidades de otras actividades de servicios comunitarios, sociales y personales, aparte de la rama de servicios sociales y de salud.

Variable Servicios sociales y salud
type: Class
subclass of: Variables Dimensión Económica
comment: Indica el número de entidades de servicio social y de salud.

Variable Empresas sin información
type: Class
subclass of: Variables Dimensión Económica
comment: Indica el número de empresas sobre las cuales no existe información.

VariableEmpresas eléctricas
type: Class
subclass of: Variables Dimensión Económica
comment: Indica el número de empresas del suministro de electricidad.

VariableEmpresas transporte
type: Class
subclass of: Variables Dimensión Económica
comment: Indica el número de empresas de transporte.

Variable Escolaridad promedio
type: Class
subclass of: Variables Dimensión Educacional
comment: Indica años de escolaridad promedio.

Variable Establecimientos educacionales Corporación Municipal
type: Class
subclass of: Variables Dimensión Educacional
comment: Indica número de establecimientos educacionales dependientes de la Corporación Municipal.

Variable Colegios privados
type: Class
subclass of: Variables Dimensión Educacional
comment: Indica número de establecimientos educacionales privados.

Variable Colegios municipales
type: Class
subclass of: Variables Dimensión Educacional
comment: Indica número de establecimientos educacionales municipales.

Variable Colegios particular pagados
type: Class
subclass of: Variables Dimensión Educacional
comment: Indica número de establecimientos educacionales particular pagados.

Variable Colegios particular subvencionados
type: Class
subclass of: Variables Dimensión Educacional
comment: Indica número de establecimientos educacionales particular subvencionados.

Variable Superficie explotaciones agropecuarias
type: Class
subclass of: Variables Dimensión Económica
comment: Indica número de hectáreas de las explotaciones agopecuarias.

Variable Superficie explotaciones forestales
type: Class
subclass of: Variables Dimensión Económica
comment: Indica las hectáreas de las explotaciones forestales.

Variable Gastos corrientes
type: Class
subclass of: Variables Dimensión Municipalidad
comment: Indica los gastos corrientes como porcentaje del gasto total.

Variable Gastos educación
type: Class
subclass of: Variables Dimensión Municipalidad
comment: Indica el monto de los gastos en educación.

Variable Gastos salud
type: Class
subclass of: Variables Dimensión Municipalidad
comment: Indica el monto de los gastos en salud.

Variable Hogares allegamiento externo
type: Class
subclass of: Variables Dimensión Social
comment: Indica número y porcentaje de hogares con allegamiento externo. Allegamiento externo se presenta en aquellas situaciones en que hay más de un hogar en la vivienda. Su cálculo se obtiene de comparar el número de hogares con el número de viviendas que hay en un momento. La Encuesta Casen permite identificar aquellos hogares que sufren allegamiento externo y además identificar al hogar que es receptor y el hogar que es allegado.

Variable Hogares allegamiento interno
type: Class
subclass of: Variables Dimensión Social
comment: Indica número y porcentaje de hogares con allegamiento intern. El allegamiento interno es la constatación de un núcleo al interior del hogar, que se constituye en el núcleo secundario o núcleo allegado.

Variable Mujeres jefe hogar
type: Class
subclass of: Variables Dimensión Social
comment: Indica número y porcentaje de hogares con mujeres jefas de hogar.

Variable Hacinamiento crítico
type: Class
subclass of: Variables Dimensión Social
comment: Indica número y porcentaje de hogares con hacinamiento crítico. El hacinamiento es la razón entre el número de personas residentes en la vivienda y el número de dormitorios de la misma, considerando piezas de uso exclusivo o uso múltiple. Contempla las categorías: sin hacinamiento, medio y crítico.

Variable Hacinamiento medio
type: Class
subclass of: Variables Dimensión Social
comment: Indica número y porcentaje de hogares con hacinamiento medio. El hacinamiento es la razón entre el número de personas residentes en la vivienda y el número de dormitorios de la misma, considerando piezas de uso exclusivo o uso múltiple. Contempla las categorías: sin hacinamiento, medio y crítico.

Variable Hogares no pobres
type: Class
subclass of: Variables Dimensión Social
comment: Indica número y porcentaje de hogares no pobres. Porcentaje de hogares cuyos ingresos son suficientes para satisfacer las necesidades básicas de sus miembros.

Variable Hogares pobres indigentes
type: Class
subclass of: Variables Dimensión Social
comment: Indica número y porcentaje de hogares indigentes. Los hogares indigentes son los hogares cuyos ingresos no son suficientes para costear una canasta básica de alimentos a sus miembros.

Variable Hogares pobres no indigentes
type: Class
subclass of: Variables Dimensión Social
comment: Indica número y porcentaje de hogares pobres no indigentes. Porcentaje de hogares cuyos ingresos no son suficientes para satisfacer las necesidades básicas de sus miembros.

Variable Hogares sin allegamiento externo
type: Class
subclass of: Variables Dimensión Social
comment: Indica número y porcentaje de hogares sin allegamiento externo. Allegamiento externo se presenta en aquellas situaciones en que hay más de un hogar en la vivienda. Su cálculo se obtiene de comparar el número de hogares con el número de viviendas que hay en un momento. La Encuesta Casen permite identificar aquellos hogares que sufren allegamiento externo y además identificar al hogar que es receptor y el hogar que es allegado.

Variable Hogares sin allegamiento interno
type: Class
subclass of: Variables Dimensión Social
comment: Indica número y porcentaje de hogares sin allegamiento interno. El allegamiento interno es la constatación de un núcleo al interior del hogar, que se constituye en el núcleo secundario o núcleo allegado.

Variable Hogares sin hacinamiento
type: Class
subclass of: Variables Dimensión Social
comment: Indica número y porcentaje de hogares sin hacinamiento. El hacinamiento es la razón entre el número de personas residentes en la vivienda y el número de dormitorios de la misma, considerando piezas de uso exclusivo o uso múltiple. Contempla las categorías: sin hacinamiento, medio y crítico.

Variable Índice de adultos mayores
type: Class
subclass of: Variables Dimensión Demográfica
comment: Es una medida demográfica del envejecimiento y representa el número de adultos mayores (65 o más años) por cada cien niños (0 a 14 años).

Variable Índice de dependencia demográfica
type: Class
subclass of: Variables Dimensión Demográfica
comment: Deriva de la composición por edades de la población y se calcula por la suma de los menores de 15 años y los mayores de 64 años divididos por la población con edades entre 15 y 64 años, por cien. Esta relación es una medida indirecta del número de personas dependientes económicamente.

Variable Índice de masculinidad
type: Class
subclass of: Variables Dimensión Demográfica
comment: Corresponde al número de hombres por cada 100 mujeres.

Variable Ingreso autónomo hogares
type: Class
subclass of: Variables Dimensión Social
comment: Indica el monto del ingreso autónomo promedio de los hogares. El ingreso autónomo es ingreso por concepto de sueldos y salarios, ganancias provenientes del trabajo independiente, auto provisión de bienes producidos por el hogar, bonificaciones, gratificaciones, rentas, intereses, así como jubilaciones, pensiones, montepíos y transferencias entre privados.

Variable Ingreso monetario hogares
type: Class
subclass of: Variables Dimensión Social
comment: Indica el monto del ingreso monetario promedio de los hogares. El ingreso monetario es la suma del ingreso autónomo y los subsidios monetarios.

Variable Ingresos FCM
type: Class
subclass of: Variables Dimensión Municipalidad
comment: Indica el porcentaje de los ingresos totales proveniente del Fondo Común Municipal.

Variable Ingresos propios permanentes
type: Class
subclass of: Variables Dimensión Municipalidad
comment: Indica el procentaje de los ingresos totales proveniente de los ingresos propios permanentes.

Variable Ingresos transferencias
type: Class
subclass of: Variables Dimensión Municipalidad
comment: Indica el porcentaje de los ingresos totales proveniente de las transferencias.

VariableInversión municipal
type: Class
subclass of: Variables Dimensión Municipalidad
comment: Indica la inversión como porcentaje del gasto total.

Variable Juntas vecinos
type: Class
subclass of: Variables Dimensión Municipalidad
comment: Indica número de juntas de vecinos.

Variable Matrícula Corporaciones Municipales
type: Class
subclass of: Variables Dimensión Educacional
comment: Indica número de matriculados en colegios de Corporación Municipal.

Variable Matrícula Corporación Privada
type: Class
subclass of: Variables Dimensión Educacional
comment: Indica número de matriculados en colegios de Corporación Privada.

Variable Matrícula municipal
type: Class
subclass of: Variables Dimensión Educacional
comment: Indica número de matriculados en colegios de Corporación Privada.

Variable Matrícula básica adultos
type: Class
subclass of: Variables Dimensión Educacional
comment: Indica número de matriculados en nivel de educación básica de adultos.

Variable Matrícula báscia niños
type: Class
subclass of: Variables Dimensión Educacional
comment: Indica número de matriculados en nivel de educación básica de niños.

Variable Matrícula educación especial
type: Class
subclass of: Variables Dimensión Educacional
comment: Indica número de matriculados en educación especial.

Variable Matrícula media adultos
type: Class
subclass of: Variables Dimensión Educacional
comment: ndica número de matriculados en nivel de educación media de adultos.

Variable Matrícula media niños
type: Class
subclass of: Variables Dimensión Educacional
comment: Indica número de matriculados en educación media de niños.

Variable Matrícula parvularia
type: Class
subclass of: Variables Dimensión Educacional
comment: Indica número de matriculados parvularios.

Variable Matrícula cárceles
type: Class
subclass of: Variables Dimensión Educacional
comment: Indica número de matriculados en escuelas al interior de cárceles.

Variable Matrícula particular pagados
type: Class
subclass of: Variables Dimensión Educacional
comment: Indica número de matriculados en colegios particular pagados.

Variable Matrícula particular subvencionados
type: Class
subclass of: Variables Dimensión Educacional
comment: Indica número de matriculados en colegios particular subvencionados.

Variable Microempresas
type: Class
subclass of: Variables Dimensión Económica
comment: Indica el número de empresas con ventas anuales de 0,01 UF a 2.400 UF.

Variable Niños desnutridos
type: Class
subclass of: Variables Dimensión Salud
comment: Indica número y porcentaje de la población total, de los niños desnutridos o de peso bajo el normal.

Variable Niños peso normal
type: Class
subclass of: Variables Dimensión Salud
comment: Indica número y porcentaje de niños con peso normal.

Variable Niños obesos
type: Class
subclass of: Variables Dimensión Salud
comment: Indica número y porcentaje de niños con sobre peso u obesos.

Variable Nivel educación básica completa
type: Class
subclass of: Variables Dimensión Educacional
comment: Indica número de personas con nivel educación básica completa.

Variable Nivel educación básica incompleta
type: Class
subclass of: Variables Dimensión Educacional
comment: Indica número de personas con nivel educación básica incompleta.

Variable Nivel educación media completa
type: Class
subclass of: Variables Dimensión Educacional
comment: Indica número de personas con nivel educación media completa.

Variable Nivel educación media incompleta
type: Class
subclass of: Variables Dimensión Educacional
comment: Indica número de personas con nivel educación media incompleta.

Variable Nivel educación superior completa
type: Class
subclass of: Variables Dimensión Educacional
comment: Indica número de personas con nivel educación superior completa.

Variable Nivel educación superior incompleta
type: Class
subclass of: Variables Dimensión Educacional
comment: Indica número de personas con nivel educación superior incompleta.

Variable Nivel sin educación
type: Class
subclass of: Variables Dimensión Educacional
comment: Indica número de personas sin educación.

Variable Número de bovinos
type: Class
subclass of: Variables Dimensión Económica
comment: Indica número de bovinos.

Variable Número de camélidos
type: Class
subclass of: Variables Dimensión Económica
comment: Indica número de camélidos.

Variable Número de caprinos
type: Class
subclass of: Variables Dimensión Económica
comment: Indica número de caprinos.

Variable Centros salud ambulatorios
type: Class
subclass of: Variables Dimensión Salud
comment: Indica número de centros de salud ambulatorios.

Variable Número de cerdos
type: Class
subclass of: Variables Dimensión Económica
comment: Indica número de cerdos.

Variable Número de ciervos
type: Class
subclass of: Variables Dimensión Económica
comment: Indica el número de ciervos.

Variable Número de conejos
type: Class
subclass of: Variables Dimensión Económica
comment: Indica el número de conejos.

Variable Número de equinos
type: Class
subclass of: Variables Dimensión Económica
comment: Indica el número de equinos.

Variable Numero Hospitales
type: Class
subclass of: Variables Dimensión Salud
comment: Indica el número de hospitales.

Variable Número de jabalíes
type: Class
subclass of: Variables Dimensión Económica
comment: Indica el número de jabalíes.

Variable Número de ovinos
type: Class
subclass of: Variables Dimensión Económica
comment: Indica el número de ovinos.

Variable Número Postas rurales
type: Class
subclass of: Variables Dimensión Salud
comment: Indica número de postas rurales.

Variable Origen del dato
type: Class
subclass of: Thing
comment: Fuentes oficiales del Estado de Chile

Variable Otras organizaciones
type: Class
subclass of: Variables Dimensión Municipalidad
comment: Indica número de otras organizaciones.

Variable Vivienda otro tipo
type: Class
subclass of: Variables Dimensión Social
comment: Indica número y porentaje de otro tipo de vivienda.

Variable Empresas pequeñas
type: Class
subclass of: Variables Dimensión Económica
comment: Indica número de empresas con ventas anuales de 2.400,01 UF a 25.000 UF.

Variable personas no pobres
type: Class
subclass of: Variables Dimensión Social
comment: Indica número y porcentaje de personas no pobres. Los no pobres son personas cuyo ingreso es suficiente para satisfacer las necesidades básicas de sus miembros.

Variable personas pobres indigentes
type: Class
subclass of: Variables Dimensión Social
comment: Indica número y porcentaje de personas pobres indigentes. Los pobres indigentes son personas cuyo ingreso es insuficiente para satisfacer sus necesidades alimentarías; esto es, que pertenecen a hogares cuyos ingresos no son suficientes para costear una canasta básica de alimentos a sus miembros.

Variable personas pobres no indigentes
type: Class
subclass of: Variables Dimensión Social
comment: Indica número y porcentaje de personas pobres no indigentes. Los pobres no indigentes son personas cuyo ingreso es suficiente para satisfacer sus necesidades básicas; esto es, que pertenecen a hogares cuyos ingresos son suficientes para satisfacer las necesidades básicas de sus miembros.

Variable personas desocupadas
type: Class
subclass of: Variables Dimensión Económica
comment: Indica el número de personas de 15 años y más que, durante la semana anterior a la realización de la encuesta, se encontraban sin empleo, y que, en las últimas cuatro semanas anteriores a la realización de la encuesta, hicieron esfuerzos concretos para conseguir empleo.

Variable Población por etnia atacameña
type: Class
subclass of: Variables Dimensión Demográfica
comment: Indica la cantidad de habitantes que se declaran pertenecientes a esta etnia.

Variable Población por etnia aymara
type: Class
subclass of: Variables Dimensión Demográfica
comment: Indica la cantidad de habitantes que se declaran pertenecientes a esta etnia.

Variable Población por etnia mapuche
type: Class
subclass of: Variables Dimensión Demográfica
comment: Indica la cantidad de habitantes que se declaran pertenecientes a esta etnia.

Variable Población por etnia otra
type: Class
subclass of: Variables Dimensión Demográfica
comment: Indica la cantidad de habitantes que se declaran pertenecientes a esta etnia.

Variable Población por etnia rapanui
type: Class
subclass of: Variables Dimensión Demográfica
comment: Indica la cantidad de habitantes que se declaran pertenecientes a esta etnia.

Variable FONASA Tramo A
type: Class
subclass of: Variables Dimensión Salud
comment: Indica número y porcentaje de las personas inscritas en FONASA, Tramo A. Tramo A :Son las personas o los integrantes del hogar que carecen de ingresos o un trabajo formal. Serán consideradas como carentes de recursos también las personas que perciben un Subsidio Único Familiar (SUF) o una Pensión Básica Solidaria (PBS).

Variable FONASA Tramo B
type: Class
subclass of: Variables Dimensión Salud
comment: Indica número y porcentaje de las personas inscritas en FONASA, Tramo B. Tramo B: Son todas aquellas personas que perciben un ingreso menor al sueldo mínimo, tiene acceso y gratuidad en las atenciones de salud en la red pública.

Variable FONASA Tramo C
type: Class
subclass of: Variables Dimensión Salud
comment: Indica número y porcentaje de las personas inscritas en FONASA, Tramo C. Tramo C y D: Son todas aquellas personas que perciben un ingreso mayor al sueldo mínimo, tienen copagos establecidos.

Variable FONASA Tramo D
type: Class
subclass of: Variables Dimensión Salud
comment: Indica número y porcentaje de las personas inscritas en FONASA, Tramo D. Tramo C y D: Son todas aquellas personas que perciben un ingreso mayor al sueldo mínimo, tienen copagos establecidos.

Variable Población por grupo etario 0 a 14 años.
type: Class
subclass of: Variables Dimensión Demográfica
comment: Indica la cantidad de la población que pertenece a este grupo etario.

Variable Población por grupo etario 15 a 29 años
type: Class
subclass of: Variables Dimensión Demográfica
comment: Indica la cantidad de la población que pertenece a este grupo etario.

Variable Población por grupo etario 30 a 44 años
type: Class
subclass of: Variables Dimensión Demográfica
comment: Indica la cantidad de la población que pertenece a este grupo etario.

Variable Población por grupo etario 45 a 64 años
type: Class
subclass of: Variables Dimensión Demográfica
comment: Indica la cantidad de la población que pertenece a este grupo etario.

Variable Población por grupo etario 65 y más años
type: Class
subclass of: Variables Dimensión Demográfica
comment: Indica la cantidad de la población que pertenece a este grupo etario.

Variable Personas inactivas
type: Class
subclass of: Variables Dimensión Económica
comment: Indica el número de personas de 15 años y más que durante el período de referencia de la encuesta no se encontraban ocupadas ni desocupadas (estudiantes, jubilados, otra situación), esto es, no integran la población económicamente activa.

Variable Poblacion Inscrita servicio salud municipal
type: Class
subclass of: Variables Dimensión Salud
comment: Indica número de personas inscritas en el servicio de salud municipal.

Variable Poblacion ocupadas
type: Class
subclass of: Variables Dimensión Económica
comment: Indica el número de personas de 15 años y más que durante la semana anterior a la realización de la encuesta trabajaron a lo menos una hora: por un sueldo o salario, de forma independiente para obtener beneficios o ganancia familiar (incluye a los familiares no remunerados), como aprendices o realizando una práctica; y personas con empleo pero que, durante el período de referencia, estuvieron temporalmente ausentes de su trabajo por licencia, huelga, enfermedad, vacaciones u otra razón.

Variable Población por sexo femenino
type: Class
subclass of: Variables Dimensión Demográfica
comment: Se refiere al número de mujeres en un área determinada.

Variable Población por sexo masculino
type: Class
subclass of: Variables Dimensión Demográfica
comment: Se refiere al número de hombres en un área determinada.

Variable Población por religión Católica
type: Class
subclass of: Variables Dimensión Demográfica
comment: Indica la cantidad de habitantes que se declaran pertenecientes a esta religión.

Variable Población por religión Evangélica
type: Class
subclass of: Variables Dimensión Demográfica
comment: Indica la cantidad de habitantes que se declaran pertenecientes a esta religión.

Variable Población por religión ninguna, ateo, agnóstico
type: Class
subclass of: Variables Dimensión Demográfica
comment: Indica la cantidad de habitantes que se declaran pertenecientes a ninguna religión, ateo o agnóstico.

Variable Población por religión otra
type: Class
subclass of: Variables Dimensión Demográfica
comment: Indica la cantidad de habitantes que se declaran pertenecientes a esta religión.

Variable Población total
type: Class
subclass of: Variables Dimensión Demográfica
comment: Población total se refiere al conjunto de habitantes de un área determinada.

Variable Porcentaje superficie explotaciones agropecuarias
type: Class
subclass of: Variables Dimensión Económica
comment: Indica porcentaje de superficie de explotaciones agropecuarias de la superficie total.

Variable Porcentaje superficie explotaciones forestales
type: Class
subclass of: Variables Dimensión Económica
comment: Indica porcentaje de superficie de explotaciones forestales de la superficie total.

Variable Promedio PSU colegios municipales
type: Class
subclass of: Variables Dimensión Educacional
comment: Indica resultados promedio de la prueba PSU en los colegios municipales.

Variable Promedio PSU colegios particular pagados
type: Class
subclass of: Variables Dimensión Educacional
comment: Indica resultados promedio de la prueba PSU en los colegios particular pagados.

Variable Promedio PSU colegios particular subvencionados
type: Class
subclass of: Variables Dimensión Educacional
comment: Indica resultados promedio de la prueba PSU en los colegios particular subvencionados.

Reporte
type: Class
comment: Informe estadístico que reúne variables e indicadores que caracterizan a la población de un territorio.

Reporte comunal
type: Class
subclass of: Reporte
comment: Informe estadístico que reúne variables e indicadores que permiten caracterizar a la población comunal.

Variable SIMCE lenguaje 2° medio
type: Class
subclass of: Variables Dimensión Educacional
comment: Indica resultados de la prueba SIMCE, ámbito lenguaje, de los estudiantes de segundo medio.

VariableSIMCE matemática 2° medio
type: Class
subclass of: Variables Dimensión Educacional
comment: Indica resultados de la prueba SIMCE, ámbito matemática, de los estudiantes de segundo medio.

Variable SIMCE lenguaje 4° básico
type: Class
subclass of: Variables Dimensión Educacional
comment: Indica resultados de la prueba SIMCE, ámbito lenguaje, de los estudiantes de cuarto básico.

Variable SIMCE matemática 4° básico
type: Class
subclass of: Variables Dimensión Educacional
comment: Indica resultados de la prueba SIMCE, ámbito matemática, de los estudiantes de cuarto básico.

Variable SIMCE lenguaje 8° básico
type: Class
subclass of: Variables Dimensión Educacional
comment: Indica resultados de la prueba SIMCE, ámbito lenguaje, de los estudiantes de octavo básico.

VariableSIMCE matemática 8° básico
type: Class
subclass of: Variables Dimensión Educacional
comment: Indica resultados de la prueba SIMCE, ámbito matemática, de los estudiantes de octavo básico.

Variable Inscritos ISAPRES
type: Class
subclass of: Variables Dimensión Salud
comment: Indica número y porcentaje de personas inscritas en ISAPRES.

Variable Inscritos salud privada
type: Class
subclass of: Variables Dimensión Salud
comment: Indica número y porcentaje de personas inscritas en el sistema de salud privado.

Variable Inscritos salud pública
type: Class
subclass of: Variables Dimensión Salud
comment: Indica número y porcentaje de personas inscritas en el sistema de salud público.

Variable Subsidio monetario hogares
type: Class
subclass of: Variables Dimensión Social
comment: Indica el monto promedio de los subsidios a los hogares. Este monto indica los aportes en efectivo que distribuye el Estado a las personas y los hogares a través de sus programas sociales. Para 2009, incluye los subsidios percibidos por los hogares por concepto de Pensión Básica Solidaria de Vejez y de Invalidez, Aporte Previsional Solidario de Vejez e Invalidez, Subsidio Único Familiar, Subsidio a la Discapacidad Mental, Bonos de Protección Familiar y Bono de Egreso de Chile Solidario, Bonos Extraordinarios de Apoyo a la Familia (Marzo) / (Agosto), Subsidio al Pago del Consumo de Agua Potable, Alcantarillado y Tratamiento de Aguas Servidas (SAP), Subsidio Eléctrico, Subsidio de Cesantía y Asignación Familiar.

Variable Tasa de desocupados
type: Class
subclass of: Variables Dimensión Económica
comment: Indica el número de personas desocupadas, expresado como porcentaje de la fuerza de trabajo en el área de interés.

Variable Tasa mortalidad general
type: Class
subclass of: Variables Dimensión Salud
comment: Indica la tasa de mortalidad general en la pobalción. Tasa: número de defunciones por 1.000 habitantes del área de interés, en un cierto año.

Variable Tasa mortalidad infantil
type: Class
subclass of: Variables Dimensión Salud
comment: Tasa de mortalidad infantil. Tasa: defunciones de menores de 1 año por 1.000 nacidos vivos, en el área de interés, en un cierto año.

Variable Tasa natalidad
type: Class
subclass of: Variables Dimensión Salud
comment: Indica tasa de natalidad. Tasa: número de nacidos vivos por 1.000 habitantes, en el área de interés en un cierto año.

Variable Tasa de ocupados
type: Class
subclass of: Variables Dimensión Económica
comment: Indica número de personas ocupadas como porcentaje de la población en edad de trabajar.

Variable Tasa de participación
type: Class
subclass of: Variables Dimensión Económica
comment: Indica el número de personas en la fuerza de trabajo expresado como porcentaje de la población en edad de trabajar.

Variable Vivienda tipo casa
type: Class
subclass of: Variables Dimensión Social
comment: Indica número y porentaje de vivienda tipo casa. Casa: Individual, en Cité, en Condominio.

Variable Vivienda departamento
type: Class
subclass of: Variables Dimensión Social
comment: Indica número y porentaje de vivienda tipo departamento.

Variable Vivienda pieza
type: Class
subclass of: Variables Dimensión Social
comment: Indica número y porentaje de vivienda tipo pieza.

Variable Trabajadores empresas Administración Pública
type: Class
subclass of: Variables Dimensión Económica
comment: Indica el número de personas ocupadas en las empresas de la administración pública.

Variable Trabajadores empresas agrícolas
type: Class
subclass of: Variables Dimensión Económica
comment: Indica el número de personas ocupadas en empresas agrícolas.

Variable Trabajadores comercio mayor y menor
type: Class
subclass of: Variables Dimensión Económica
comment: Indica el número de personas ocupadas en empresas de comercio al por mayor y menor.

Variable Trabajadores empresas administración edificios
type: Class
subclass of: Variables Dimensión Económica
comment: Indica el número de personas ocupadas en empresas de la adminstración de edificios.

Variable Trabajadores empresas construcción
type: Class
subclass of: Variables Dimensión Económica
comment: Indica el número de personas ocupadas en empresas de la construcción.

Variable Trabajadores empresas enseñanza
type: Class
subclass of: Variables Dimensión Económica
comment: Indica el número de personas ocupadas en empresas de la rama de la enseñanza.

Variable Trabajadores hoteles restaurantes
type: Class
subclass of: Variables Dimensión Económica
comment: Indica el número de personas ocupadas en hoteles y restaurantes.

Variable Trabajadores empresas inmobiliarias
type: Class
subclass of: Variables Dimensión Económica
comment: Indica el número de personas ocupadas en empresas inmobiliarias.

Variable Trabajadores empresas intermediación financiera
type: Class
subclass of: Variables Dimensión Económica
comment: Indica el número de personas ocupadas en empresas de intermediación financiera.

Variable Trabajadores empresas metálicas
type: Class
subclass of: Variables Dimensión Económica
comment: Indica el número de personas ocupadas en empresas manufactureras metálicas.

Variable Trabajadores empresas no metálicas
type: Class
subclass of: Variables Dimensión Económica
comment: Indica el número de personas ocupadas en empresas mmanufactureras no metálicas.

Variable Trabajadores servicios comunitarios
type: Class
subclass of: Variables Dimensión Económica
comment: Indica número de personas ocupadas en entidades de otras actividades de servicios comunitarios, sociales y personales, aparte de la rama de servicios sociales y de salud.

Variable Trabajadores servicios comunitarios
type: Class
subclass of: Variables Dimensión Económica
comment: Indica el número de personas ocupadas en entidades de servicio comunitario.

Variable Trabajadores servicios sociales y salud
type: Class
subclass of: Variables Dimensión Económica
comment: Indica el número de personas ocupadas en entidades de servicio social y de salud.

Variable Trabajadores empresas sin información
type: Class
subclass of: Variables Dimensión Económica
comment: Indica el número de persnans ocupadas en empresas sin información.

Variable Trabajadores empresas eléctricas
type: Class
subclass of: Variables Dimensión Económica
comment: Indica el número de personas ocupadas en empresas del suministro de elecricidad.

Variable Trabajadores empresas transporte
type: Class
subclass of: Variables Dimensión Económica
comment: Indica el número de personas ocupadas en empresas de transporte.

Variable Trabajadores empresas grandes
type: Class
subclass of: Variables Dimensión Económica
comment: Indica número de persoans ocupadas en emrpesas con ventas anuales de 100.000,01 UF a más de 1.000.000 UF.

Variable Trabajadores empresas medianas
type: Class
subclass of: Variables Dimensión Económica
comment: Indica número de personas ocupadas en empresas con ventas anuales de 25.000,01 UF a 100.000 UF.

Variable Trabajadores microempresas
type: Class
subclass of: Variables Dimensión Económica
comment: Indica el número de personas ocupadas en empresas con ventas anuales de 0,01 UF a 2.400 UF.

Variable Trabajadores pequeñas empresas
type: Class
subclass of: Variables Dimensión Económica
comment: Indica número de personas ocupadas en empresas con ventas anuales de 2.400,01 UF a 25.000 UF.

Variable Uniones comunales
type: Class
subclass of: Variables Dimensión Municipalidad
comment: Indica número de uniones comunales.

Variable
type: Class
comment: La variable denota un aspecto de la realidad, el cual puede tomar un valor.

Variables Dimensión Demográfica
type: Class
subclass of: Variable
comment: Agrupa a todas las variables comprendidas dentro de la Dimensión demográfica.

Variables Dimensión Económica
type: Class
subclass of: Variable
comment: Agrupa a todas las variables comprendidas dentro de la Dimensión Económica.

Variables Dimensión Educacional
type: Class
subclass of: Variable
comment: Agrupa a todas las variables comprendidas dentro de la Dimensión educacional.

Variables Dimensión Municipalidad
type: Class
subclass of: Variable
comment: Agrupa a todas las variables comprendidas dentro de la Dimensión de la municipalidad.

Variables Dimensión Salud
type: Class
subclass of: Variable
comment: Agrupa a todas las variables comprendidas dentro de la Dimensión salud.

Variables Dimensión Seguridad Ciudadana
type: Class
subclass of: Variable
comment: Agrupa a todas las variables comprendidas dentro de la Dimensión seguridad ciudadana.

Variables Dimensión Social
type: Class
subclass of: Variable
comment: Agrupa a todas las variables comprendidas dentro de la Dimensión social.

Variable de proyección
type: Class
subclass of: Variable
comment: La proyección de población proporciona información que permite establecer escenarios futuros probables respecto de la evolución de la población del país.

Variable Viviendas arrendadas
type: Class
subclass of: Variables Dimensión Social
comment: Indica número y porcentaje de viviendas arrendadas. Se calcula a partir de la pregunta para los jefes de hogar: “¿Su hogar, bajo qué situación ocupa la vivienda?

Variable Viviendas cedidas
type: Class
subclass of: Variables Dimensión Social
comment: Indica número y porcentaje de viviendas cedidas. Se calcula a partir de la pregunta para los jefes de hogar: “¿Su hogar, bajo qué situación ocupa la vivienda?

Variable Viviendas en usufructo
type: Class
subclass of: Variables Dimensión Social
comment: Indica número y porcentaje de viviendas en usufructo. Se calcula a partir de la pregunta para los jefes de hogar: “¿Su hogar, bajo qué situación ocupa la vivienda?

Variable Viviendas ocupación irregular
type: Class
subclass of: Variables Dimensión Social
comment: Indica número y porcentaje de viviendas en situación de ocupación irregular. Se calcula a partir de la pregunta para los jefes de hogar: “¿Su hogar, bajo qué situación ocupa la vivienda?

Variable Viviendas pagadas
type: Class
subclass of: Variables Dimensión Social
comment: Indica número y porcentaje de viviendas pagadas. Se calcula a partir de la pregunta para los jefes de hogar: “¿Su hogar, bajo qué situación ocupa la vivienda?

Variable Viviendas pagándose
type: Class
subclass of: Variables Dimensión Social
comment: Indica número y porcentaje de viviendas pagándose. Se calcula a partir de la pregunta para los jefes de hogar: ¿Su hogar, bajo qué situación ocupa la vivienda?