Ontología Reportes Comunales
type: Ontology
comment: Ontología de Reportes Comunales de SIIT.
imports: bcn-geographics#
imports: http://purl.org/dc/elements/1.1/
imports: time
version info: 1.1

Dimensión
type: Class
comment: Conjunto de variables e indicadores que permiten caraterizar a la población comunal.

Dimensión demográfica
type: Class
comment: Conjunto de variables e indicadores que permiten caracterizar a la población desde la perspectiva demográfica
subclass of: Dimensión

Dimensión económica
type: Class
comment: Conjunto de variables e indicadores que permiten caracterizar a la población desde la perspectiva económica.
subclass of: Dimensión

Dimensión educacional
type: Class
comment: Conjunto de variables e indicadores que permiten caracterizar a la población desde la perspectiva educacional.
subclass of: Dimensión

Dimensión municipalidad
type: Class
comment: Conjunto de variables e indicadores que permiten caracterizar a la población desde la perspectiva de la administración municipal.
subclass of: Dimensión

Dimensión salud
type: Class
comment: Conjunto de variables e indicadores que permiten caracterizar a la población desde la perspectiva de la salud
subclass of: Dimensión

Dimensión seguridad ciudadana
type: Class
comment: Conjunto de variables e indicadores que permiten caracterizar a la población desde la perspectiva de la seguridad ciudadana
subclass of: Dimensión

Dimensión social
type: Class
comment: Conjunto de variables e indicadores que permiten caracterizar a la población desde la perspectiva de la realidad social
subclass of: Dimensión

Reporte
type: Class
comment: Informe estadístico que reúne variables e indicadores que caracterizan a la población de un territorio.

Reporte comunal
type: Class
comment: Informe estadístico que reúne variables e indicadores que permiten caracterizar a la población comunal.
subclass of: Reporte

Variable
type: Class
comment: La variable denota un aspecto de la realidad, el cual puede tomar un valor.

Variable estudiantes PSU sobre 450
type: Class
comment: Indica porcentaje de postulantes con resultados PSU sobre 450 puntos.
subclass of: Variables Dimensión Educacional

Variable Calidad Viviendas aceptables
type: Class
comment: Indica número y porcentaje de las viviendas en estado aceptable. El Indice de Calidad Global de la Vivienda, que diferencia el parque de viviendas en Viviendas de calidad Aceptable, Recuperable e Irrecuperables, clasifica como Aceptables las viviendas con materialidad, saneamiento y de tipo aceptables.
subclass of: Variables Dimensión Social

Variable Calidad Viviendas irrecuperables
type: Class
comment: Indica número y porcentaje de las viviendas en estado irrecuperable. Las viviendas Irrecuperables corresponden a las viviendas con materialidad irrecuperable o tipo irrecuperable (independiente del saneamiento). Se considera como irrecuperables todas las viviendas del tipo mediagua, aun cuando su saneamiento o materialidad sean aceptables o recuperables.
subclass of: Variables Dimensión Social

Variable Calidad Viviendas recuperables
type: Class
comment: Indica número y porcentaje de las viviendas en estado recuperable. El Indice de Calidad Global de la Vivienda, que diferencia el parque de viviendas en Viviendas de calidad Aceptable, Recuperable e Irrecuperables, clasifica como Recuperables las viviendas con saneamiento deficitario o materialidad recuperables, siempre y cuando el tipo de vivienda no sea irrecuperable.
subclass of: Variables Dimensión Social

Variable Centros adultos mayores
type: Class
comment: Indica número de centros de adultos mayores.
subclass of: Variables Dimensión Municipalidad

Variable Centros apoderados
type: Class
comment: Indica número de centros de apoderados.
subclass of: Variables Dimensión Municipalidad

Variable Centros de madres
type: Class
comment: Indica número de centros de madres.
subclass of: Variables Dimensión Municipalidad

Variable Clubes deportivos
type: Class
comment: Indica número de clubes deportivos.
subclass of: Variables Dimensión Municipalidad

Variable Delitos mayor connotación
type: Class
comment: Indica cantidad de denuncias de los delitos de robo con violencia, robo con intimidación, robo por sorpresa, robo con fuerza, robo de vehículos, robo en lugar habitado, robo en lugar no habitado, hurto, lesiones, homicidio y violación por cada 100 mil habitantes.
subclass of: Variables Dimensión Seguridad Ciudadana

Variable Delitos violencia familiar
type: Class
comment: Indica cantidad de denuncias de delitos de violencia intrafamiliar por cada 100 mil habitantes.
subclass of: Variables Dimensión Seguridad Ciudadana

Variable Deuda educación
type: Class
comment: Indica la deuda flotante del ámbito educación.
subclass of: Variables Dimensión Municipalidad

Variable Deuda municipal
type: Class
comment: Indica la deuda flotante municipal. Deuda Flotante sector Municipal corresponde a los compromisos devengados y no pagados al 31 de diciembre del ejercicio presupuestario, en conformidad a lo dispuesto en los artículos N° 12 y N° 19 del D.L. N° 1.263 de 1975. Indicador creado en el año 2008, por cambio del Clasificador Presupuestario. La Deuda Flotante (cuenta 215.34.07.000.000 del Clasificador Presupuestario) de la Ejecución Presupuestaria no es deuda acumulada ni vencida del municipio, sino que es la diferencia, al cierre de ejercicio, entre el total de gastos devengados en el ejercicio y el total de pagos correspondientes a esos gastos. Es decir el total de gastos devengados durante el ejercicio, que al cierre del mismo se encuentran impagos. Representa un monto global de deudas hacia terceros por montos ciertos.
subclass of: Variables Dimensión Municipalidad

Variable Deuda salud
type: Class
comment: Indica la deuda flotante.
subclass of: Variables Dimensión Municipalidad

Variables Dimensión Demográfica
type: Class
comment: Agrupa a todas las variables comprendidas dentro de la Dimensión demográfica.
subclass of: Variable

Variables Dimensión Económica
type: Class
comment: Agrupa a todas las variables comprendidas dentro de la Dimensión Económica.
subclass of: Variable

Variables Dimensión Educacional
type: Class
comment: Agrupa a todas las variables comprendidas dentro de la Dimensión educacional.
subclass of: Variable

Variables Dimensión Municipalidad
type: Class
comment: Agrupa a todas las variables comprendidas dentro de la Dimensión de la municipalidad.
subclass of: Variable

Variables Dimensión Salud
type: Class
comment: Agrupa a todas las variables comprendidas dentro de la Dimensión salud.
subclass of: Variable

Variables Dimensión Seguridad Ciudadana
type: Class
comment: Agrupa a todas las variables comprendidas dentro de la Dimensión seguridad ciudadana.
subclass of: Variable

Variables Dimensión Social
type: Class
comment: Agrupa a todas las variables comprendidas dentro de la Dimensión social.
subclass of: Variable

Variable Disponibilidad Presupuesto por habitante
type: Class
comment: Indica el monto del presupuesto municipal disponible por habitante (en miles de pesos).
subclass of: Variables Dimensión Municipalidad

VariableEmpleados permanentes hombres silvoagropecuarios
type: Class
comment: Indica número de hombres empleados de forma permanente en el sector silvoagropecuario.
subclass of: Variables Dimensión Económica

Variable Empleadas permanentes mujeres silvoagropecuarias
type: Class
comment: Indica el número de mujeres empleadas de forma permanente, en el sector silvoagropecuario.
subclass of: Variables Dimensión Económica

Variable Empresas Adminsitración Pública
type: Class
comment: Indica el número de empresas de la adminstración pública y defensa, planes de seguridad social de afiliación obligatoria.
subclass of: Variables Dimensión Económica

Variable Empresas agrícolas
type: Class
comment: Indica número de empresas de la rama de la agricultura, ganadería, caza y silvicultua.
subclass of: Variables Dimensión Económica

Variable Empresas comercio mayor y menor
type: Class
comment: Indica número de empresas de la rama del comercio al por mayor y menor, repuestos, vehículos, automotores/enseres domésticos.
subclass of: Variables Dimensión Económica

VariableEmpresas administración edificios
type: Class
comment: Indica número de empresas de consejo de administración de edificios.
subclass of: Variables Dimensión Económica

Variable Empresas construcción
type: Class
comment: Indica número de empresas de la rama de la construcción.
subclass of: Variables Dimensión Económica

Variable Empresas enseñanza
type: Class
comment: Indica número de empresas de la rama de la enseñanza.
subclass of: Variables Dimensión Económica

Variable Empresas grandes
type: Class
comment: Indica número de emrpesas con ventas anuales de 100.000,01 UF a más de 1.000.000 UF.
subclass of: Variables Dimensión Económica

Variable Empresas hoteles restaurantes
type: Class
comment: Indica número de empresas de la rama de hoteles y restaurantes.
subclass of: Variables Dimensión Económica

VariableEmpresas inmobiliarias
type: Class
comment: Indica el número de emrpesas inmobiliarias.
subclass of: Variables Dimensión Económica

Variable Empresas intermediación financiera
type: Class
comment: Indica número de empresas de intermediación financiera.
subclass of: Variables Dimensión Económica

Variable Empresas manufactureras metálicas
type: Class
comment: Indica número de empresas manufactureras metálicas
subclass of: Variables Dimensión Económica

Variable Empresas manufactureras no metálicas
type: Class
comment: Indica número de empresas manufactureras no metálicas.
subclass of: Variables Dimensión Económica

Variable Empresas medianas
type: Class
comment: Indica número de empresas con ventas anuales de 25.000,01 UF a 100.000 UF.
subclass of: Variables Dimensión Económica

Variable Órganos extraterritoriales
type: Class
comment: Indica número de organizaciones y órganos extraterritoriales.
subclass of: Variables Dimensión Económica

Variable Empresas pequeñas
type: Class
comment: Indica número de empresas con ventas anuales de 2.400,01 UF a 25.000 UF.
subclass of: Variables Dimensión Económica

Variable Servicios comunitarios
type: Class
comment: Indica en número de entidades de otras actividades de servicios comunitarios, sociales y personales, aparte de la rama de servicios sociales y de salud.
subclass of: Variables Dimensión Económica

Variable Servicios sociales y salud
type: Class
comment: Indica el número de entidades de servicio social y de salud.
subclass of: Variables Dimensión Económica

Variable Empresas sin información
type: Class
comment: Indica el número de empresas sobre las cuales no existe información.
subclass of: Variables Dimensión Económica

VariableEmpresas eléctricas
type: Class
comment: Indica el número de empresas del suministro de electricidad.
subclass of: Variables Dimensión Económica

VariableEmpresas transporte
type: Class
comment: Indica el número de empresas de transporte.
subclass of: Variables Dimensión Económica

Variable Escolaridad promedio
type: Class
comment: Indica años de escolaridad promedio.
subclass of: Variables Dimensión Educacional

Variable Establecimientos educacionales Corporación Municipal
type: Class
comment: Indica número de establecimientos educacionales dependientes de la Corporación Municipal.
subclass of: Variables Dimensión Educacional

Variable Colegios privados
type: Class
comment: Indica número de establecimientos educacionales privados.
subclass of: Variables Dimensión Educacional

Variable Colegios municipales
type: Class
comment: Indica número de establecimientos educacionales municipales.
subclass of: Variables Dimensión Educacional

Variable Colegios particular pagados
type: Class
comment: Indica número de establecimientos educacionales particular pagados.
subclass of: Variables Dimensión Educacional

Variable Colegios particular subvencionados
type: Class
comment: Indica número de establecimientos educacionales particular subvencionados.
subclass of: Variables Dimensión Educacional

Variable Superficie explotaciones agropecuarias
type: Class
comment: Indica número de hectáreas de las explotaciones agopecuarias.
subclass of: Variables Dimensión Económica

Variable Superficie explotaciones forestales
type: Class
comment: Indica las hectáreas de las explotaciones forestales.
subclass of: Variables Dimensión Económica

Variable Gastos corrientes
type: Class
comment: Indica los gastos corrientes como porcentaje del gasto total.
subclass of: Variables Dimensión Municipalidad

Variable Gastos educación
type: Class
comment: Indica el monto de los gastos en educación.
subclass of: Variables Dimensión Municipalidad

Variable Gastos salud
type: Class
comment: Indica el monto de los gastos en salud.
subclass of: Variables Dimensión Municipalidad

Variable Hogares allegamiento externo
type: Class
comment: Indica número y porcentaje de hogares con allegamiento externo. Allegamiento externo se presenta en aquellas situaciones en que hay más de un hogar en la vivienda. Su cálculo se obtiene de comparar el número de hogares con el número de viviendas que hay en un momento. La Encuesta Casen permite identificar aquellos hogares que sufren allegamiento externo y además identificar al hogar que es receptor y el hogar que es allegado.
subclass of: Variables Dimensión Social

Variable Hogares allegamiento interno
type: Class
comment: Indica número y porcentaje de hogares con allegamiento intern. El allegamiento interno es la constatación de un núcleo al interior del hogar, que se constituye en el núcleo secundario o núcleo allegado.
subclass of: Variables Dimensión Social

Variable Mujeres jefe hogar
type: Class
comment: Indica número y porcentaje de hogares con mujeres jefas de hogar.
subclass of: Variables Dimensión Social

Variable Hacinamiento crítico
type: Class
comment: Indica número y porcentaje de hogares con hacinamiento crítico. El hacinamiento es la razón entre el número de personas residentes en la vivienda y el número de dormitorios de la misma, considerando piezas de uso exclusivo o uso múltiple. Contempla las categorías: sin hacinamiento, medio y crítico.
subclass of: Variables Dimensión Social

Variable Hacinamiento medio
type: Class
comment: Indica número y porcentaje de hogares con hacinamiento medio. El hacinamiento es la razón entre el número de personas residentes en la vivienda y el número de dormitorios de la misma, considerando piezas de uso exclusivo o uso múltiple. Contempla las categorías: sin hacinamiento, medio y crítico.
subclass of: Variables Dimensión Social

Variable Hogares no pobres
type: Class
comment: Indica número y porcentaje de hogares no pobres. Porcentaje de hogares cuyos ingresos son suficientes para satisfacer las necesidades básicas de sus miembros.
subclass of: Variables Dimensión Social

Variable Hogares pobres indigentes
type: Class
comment: Indica número y porcentaje de hogares indigentes. Los hogares indigentes son los hogares cuyos ingresos no son suficientes para costear una canasta básica de alimentos a sus miembros.
subclass of: Variables Dimensión Social

Variable Hogares pobres no indigentes
type: Class
comment: Indica número y porcentaje de hogares pobres no indigentes. Porcentaje de hogares cuyos ingresos no son suficientes para satisfacer las necesidades básicas de sus miembros.
subclass of: Variables Dimensión Social

Variable Hogares sin allegamiento externo
type: Class
comment: Indica número y porcentaje de hogares sin allegamiento externo. Allegamiento externo se presenta en aquellas situaciones en que hay más de un hogar en la vivienda. Su cálculo se obtiene de comparar el número de hogares con el número de viviendas que hay en un momento. La Encuesta Casen permite identificar aquellos hogares que sufren allegamiento externo y además identificar al hogar que es receptor y el hogar que es allegado.
subclass of: Variables Dimensión Social

Variable Hogares sin allegamiento interno
type: Class
comment: Indica número y porcentaje de hogares sin allegamiento interno. El allegamiento interno es la constatación de un núcleo al interior del hogar, que se constituye en el núcleo secundario o núcleo allegado.
subclass of: Variables Dimensión Social

Variable Hogares sin hacinamiento
type: Class
comment: Indica número y porcentaje de hogares sin hacinamiento. El hacinamiento es la razón entre el número de personas residentes en la vivienda y el número de dormitorios de la misma, considerando piezas de uso exclusivo o uso múltiple. Contempla las categorías: sin hacinamiento, medio y crítico.
subclass of: Variables Dimensión Social

Variable Índice de adultos mayores
type: Class
comment: Es una medida demográfica del envejecimiento y representa el número de adultos mayores (65 o más años) por cada cien niños (0 a 14 años).
subclass of: Variables Dimensión Demográfica

Variable Índice de dependencia demográfica
type: Class
comment: Deriva de la composición por edades de la población y se calcula por la suma de los menores de 15 años y los mayores de 64 años divididos por la población con edades entre 15 y 64 años, por cien. Esta relación es una medida indirecta del número de personas dependientes económicamente.
subclass of: Variables Dimensión Demográfica

Variable Índice de masculinidad
type: Class
comment: Corresponde al número de hombres por cada 100 mujeres.
subclass of: Variables Dimensión Demográfica

Variable Ingreso autónomo hogares
type: Class
comment: Indica el monto del ingreso autónomo promedio de los hogares. El ingreso autónomo es ingreso por concepto de sueldos y salarios, ganancias provenientes del trabajo independiente, auto provisión de bienes producidos por el hogar, bonificaciones, gratificaciones, rentas, intereses, así como jubilaciones, pensiones, montepíos y transferencias entre privados.
subclass of: Variables Dimensión Social

Variable Ingreso monetario hogares
type: Class
comment: Indica el monto del ingreso monetario promedio de los hogares. El ingreso monetario es la suma del ingreso autónomo y los subsidios monetarios.
subclass of: Variables Dimensión Social

Variable Ingresos FCM
type: Class
comment: Indica el porcentaje de los ingresos totales proveniente del Fondo Común Municipal.
subclass of: Variables Dimensión Municipalidad

Variable Ingresos propios permanentes
type: Class
comment: Indica el procentaje de los ingresos totales proveniente de los ingresos propios permanentes.
subclass of: Variables Dimensión Municipalidad

Variable Ingresos transferencias
type: Class
comment: Indica el porcentaje de los ingresos totales proveniente de las transferencias.
subclass of: Variables Dimensión Municipalidad

VariableInversión municipal
type: Class
comment: Indica la inversión como porcentaje del gasto total.
subclass of: Variables Dimensión Municipalidad

Variable Juntas vecinos
type: Class
comment: Indica número de juntas de vecinos.
subclass of: Variables Dimensión Municipalidad

Variable Matrícula Corporaciones Municipales
type: Class
comment: Indica número de matriculados en colegios de Corporación Municipal.
subclass of: Variables Dimensión Educacional

Variable Matrícula Corporación Privada
type: Class
comment: Indica número de matriculados en colegios de Corporación Privada.
subclass of: Variables Dimensión Educacional

Variable Matrícula municipal
type: Class
comment: Indica número de matriculados en colegios de Corporación Privada.
subclass of: Variables Dimensión Educacional

Variable Matrícula básica adultos
type: Class
comment: Indica número de matriculados en nivel de educación básica de adultos.
subclass of: Variables Dimensión Educacional

Variable Matrícula báscia niños
type: Class
comment: Indica número de matriculados en nivel de educación básica de niños.
subclass of: Variables Dimensión Educacional

Variable Matrícula educación especial
type: Class
comment: Indica número de matriculados en educación especial.
subclass of: Variables Dimensión Educacional

Variable Matrícula media adultos
type: Class
comment: ndica número de matriculados en nivel de educación media de adultos.
subclass of: Variables Dimensión Educacional

Variable Matrícula media niños
type: Class
comment: Indica número de matriculados en educación media de niños.
subclass of: Variables Dimensión Educacional

Variable Matrícula parvularia
type: Class
comment: Indica número de matriculados parvularios.
subclass of: Variables Dimensión Educacional

Variable Matrícula cárceles
type: Class
comment: Indica número de matriculados en escuelas al interior de cárceles.
subclass of: Variables Dimensión Educacional

Variable Matrícula particular pagados
type: Class
comment: Indica número de matriculados en colegios particular pagados.
subclass of: Variables Dimensión Educacional

Variable Matrícula particular subvencionados
type: Class
comment: Indica número de matriculados en colegios particular subvencionados.
subclass of: Variables Dimensión Educacional

Variable Microempresas
type: Class
comment: Indica el número de empresas con ventas anuales de 0,01 UF a 2.400 UF.
subclass of: Variables Dimensión Económica

Variable Niños desnutridos
type: Class
comment: Indica número y porcentaje de la población total, de los niños desnutridos o de peso bajo el normal.
subclass of: Variables Dimensión Salud

Variable Niños peso normal
type: Class
comment: Indica número y porcentaje de niños con peso normal.
subclass of: Variables Dimensión Salud

Variable Niños obesos
type: Class
comment: Indica número y porcentaje de niños con sobre peso u obesos.
subclass of: Variables Dimensión Salud

Variable Nivel educación básica completa
type: Class
comment: Indica número de personas con nivel educación básica completa.
subclass of: Variables Dimensión Educacional

Variable Nivel educación básica incompleta
type: Class
comment: Indica número de personas con nivel educación básica incompleta.
subclass of: Variables Dimensión Educacional

Variable Nivel educación media completa
type: Class
comment: Indica número de personas con nivel educación media completa.
subclass of: Variables Dimensión Educacional

Variable Nivel educación media incompleta
type: Class
comment: Indica número de personas con nivel educación media incompleta.
subclass of: Variables Dimensión Educacional

Variable Nivel educación superior completa
type: Class
comment: Indica número de personas con nivel educación superior completa.
subclass of: Variables Dimensión Educacional

Variable Nivel educación superior incompleta
type: Class
comment: Indica número de personas con nivel educación superior incompleta.
subclass of: Variables Dimensión Educacional

Variable Nivel sin educación
type: Class
comment: Indica número de personas sin educación.
subclass of: Variables Dimensión Educacional

Variable Número de bovinos
type: Class
comment: Indica número de bovinos.
subclass of: Variables Dimensión Económica

Variable Número de camélidos
type: Class
comment: Indica número de camélidos.
subclass of: Variables Dimensión Económica

Variable Número de caprinos
type: Class
comment: Indica número de caprinos.
subclass of: Variables Dimensión Económica

Variable Centros salud ambulatorios
type: Class
comment: Indica número de centros de salud ambulatorios.
subclass of: Variables Dimensión Salud

Variable Número de cerdos
type: Class
comment: Indica número de cerdos.
subclass of: Variables Dimensión Económica

Variable Número de ciervos
type: Class
comment: Indica el número de ciervos.
subclass of: Variables Dimensión Económica

Variable Número de conejos
type: Class
comment: Indica el número de conejos.
subclass of: Variables Dimensión Económica

Variable Número de equinos
type: Class
comment: Indica el número de equinos.
subclass of: Variables Dimensión Económica

Variable Numero Hospitales
type: Class
comment: Indica el número de hospitales.
subclass of: Variables Dimensión Salud

Variable Número de jabalíes
type: Class
comment: Indica el número de jabalíes.
subclass of: Variables Dimensión Económica

Variable Número de ovinos
type: Class
comment: Indica el número de ovinos.
subclass of: Variables Dimensión Económica

Variable Número Postas rurales
type: Class
comment: Indica número de postas rurales.
subclass of: Variables Dimensión Salud

Variable Origen del dato
type: Class
comment: Fuentes oficiales del Estado de Chile
subclass of: Thing

Variable Otras organizaciones
type: Class
comment: Indica número de otras organizaciones.
subclass of: Variables Dimensión Municipalidad

Variable Vivienda otro tipo
type: Class
comment: Indica número y porentaje de otro tipo de vivienda.
subclass of: Variables Dimensión Social

Variable personas no pobres
type: Class
comment: Indica número y porcentaje de personas no pobres. Los no pobres son personas cuyo ingreso es suficiente para satisfacer las necesidades básicas de sus miembros.
subclass of: Variables Dimensión Social

Variable personas pobres indigentes
type: Class
comment: Indica número y porcentaje de personas pobres indigentes. Los pobres indigentes son personas cuyo ingreso es insuficiente para satisfacer sus necesidades alimentarías; esto es, que pertenecen a hogares cuyos ingresos no son suficientes para costear una canasta básica de alimentos a sus miembros.
subclass of: Variables Dimensión Social

Variable personas pobres no indigentes
type: Class
comment: Indica número y porcentaje de personas pobres no indigentes. Los pobres no indigentes son personas cuyo ingreso es suficiente para satisfacer sus necesidades básicas; esto es, que pertenecen a hogares cuyos ingresos son suficientes para satisfacer las necesidades básicas de sus miembros.
subclass of: Variables Dimensión Social

Variable Población por religión ninguna, ateo, agnóstico
type: Class
comment: Indica la cantidad de habitantes que se declaran pertenecientes a ninguna religión, ateo o agnóstico.
subclass of: Variables Dimensión Demográfica

Variable personas desocupadas
type: Class
comment: Indica el número de personas de 15 años y más que, durante la semana anterior a la realización de la encuesta, se encontraban sin empleo, y que, en las últimas cuatro semanas anteriores a la realización de la encuesta, hicieron esfuerzos concretos para conseguir empleo.
subclass of: Variables Dimensión Económica

Variable Población por etnia atacameña
type: Class
comment: Indica la cantidad de habitantes que se declaran pertenecientes a esta etnia.
subclass of: Variables Dimensión Demográfica

Variable Población por etnia aymara
type: Class
comment: Indica la cantidad de habitantes que se declaran pertenecientes a esta etnia.
subclass of: Variables Dimensión Demográfica

Variable Población por etnia mapuche
type: Class
comment: Indica la cantidad de habitantes que se declaran pertenecientes a esta etnia.
subclass of: Variables Dimensión Demográfica

Variable Población por etnia otra
type: Class
comment: Indica la cantidad de habitantes que se declaran pertenecientes a esta etnia.
subclass of: Variables Dimensión Demográfica

Variable Población por etnia rapanui
type: Class
comment: Indica la cantidad de habitantes que se declaran pertenecientes a esta etnia.
subclass of: Variables Dimensión Demográfica

Variable FONASA Tramo A
type: Class
comment: Indica número y porcentaje de las personas inscritas en FONASA, Tramo A. Tramo A :Son las personas o los integrantes del hogar que carecen de ingresos o un trabajo formal. Serán consideradas como carentes de recursos también las personas que perciben un Subsidio Único Familiar (SUF) o una Pensión Básica Solidaria (PBS).
subclass of: Variables Dimensión Salud

Variable FONASA Tramo B
type: Class
comment: Indica número y porcentaje de las personas inscritas en FONASA, Tramo B. Tramo B: Son todas aquellas personas que perciben un ingreso menor al sueldo mínimo, tiene acceso y gratuidad en las atenciones de salud en la red pública.
subclass of: Variables Dimensión Salud

Variable FONASA Tramo C
type: Class
comment: Indica número y porcentaje de las personas inscritas en FONASA, Tramo C. Tramo C y D: Son todas aquellas personas que perciben un ingreso mayor al sueldo mínimo, tienen copagos establecidos.
subclass of: Variables Dimensión Salud

Variable FONASA Tramo D
type: Class
comment: Indica número y porcentaje de las personas inscritas en FONASA, Tramo D. Tramo C y D: Son todas aquellas personas que perciben un ingreso mayor al sueldo mínimo, tienen copagos establecidos.
subclass of: Variables Dimensión Salud

Variable Población por grupo etario 0 a 14 años.
type: Class
comment: Indica la cantidad de la población que pertenece a este grupo etario.
subclass of: Variables Dimensión Demográfica

Variable Población por grupo etario 15 a 29 años
type: Class
comment: Indica la cantidad de la población que pertenece a este grupo etario.
subclass of: Variables Dimensión Demográfica

Variable Población por grupo etario 30 a 44 años
type: Class
comment: Indica la cantidad de la población que pertenece a este grupo etario.
subclass of: Variables Dimensión Demográfica

Variable Población por grupo etario 45 a 64 años
type: Class
comment: Indica la cantidad de la población que pertenece a este grupo etario.
subclass of: Variables Dimensión Demográfica

Variable Población por grupo etario 65 y más años
type: Class
comment: Indica la cantidad de la población que pertenece a este grupo etario.
subclass of: Variables Dimensión Demográfica

Variable Personas inactivas
type: Class
comment: Indica el número de personas de 15 años y más que durante el período de referencia de la encuesta no se encontraban ocupadas ni desocupadas (estudiantes, jubilados, otra situación), esto es, no integran la población económicamente activa.
subclass of: Variables Dimensión Económica

Variable Poblacion Inscrita servicio salud municipal
type: Class
comment: Indica número de personas inscritas en el servicio de salud municipal.
subclass of: Variables Dimensión Salud

Variable Poblacion ocupadas
type: Class
comment: Indica el número de personas de 15 años y más que durante la semana anterior a la realización de la encuesta trabajaron a lo menos una hora: por un sueldo o salario, de forma independiente para obtener beneficios o ganancia familiar (incluye a los familiares no remunerados), como aprendices o realizando una práctica; y personas con empleo pero que, durante el período de referencia, estuvieron temporalmente ausentes de su trabajo por licencia, huelga, enfermedad, vacaciones u otra razón.
subclass of: Variables Dimensión Económica

Variable Población por sexo femenino
type: Class
comment: Se refiere al número de mujeres en un área determinada.
subclass of: Variables Dimensión Demográfica

Variable Población por sexo masculino
type: Class
comment: Se refiere al número de hombres en un área determinada.
subclass of: Variables Dimensión Demográfica

Variable Población por religión Católica
type: Class
comment: Indica la cantidad de habitantes que se declaran pertenecientes a esta religión.
subclass of: Variables Dimensión Demográfica

Variable Población por religión Evangélica
type: Class
comment: Indica la cantidad de habitantes que se declaran pertenecientes a esta religión.
subclass of: Variables Dimensión Demográfica

Variable Población por religión otra
type: Class
comment: Indica la cantidad de habitantes que se declaran pertenecientes a esta religión.
subclass of: Variables Dimensión Demográfica

Variable Población total
type: Class
comment: Población total se refiere al conjunto de habitantes de un área determinada.
subclass of: Variables Dimensión Demográfica

Variable Porcentaje superficie explotaciones agropecuarias
type: Class
comment: Indica porcentaje de superficie de explotaciones agropecuarias de la superficie total.
subclass of: Variables Dimensión Económica

Variable Porcentaje superficie explotaciones forestales
type: Class
comment: Indica porcentaje de superficie de explotaciones forestales de la superficie total.
subclass of: Variables Dimensión Económica

Variable Promedio PSU colegios municipales
type: Class
comment: Indica resultados promedio de la prueba PSU en los colegios municipales.
subclass of: Variables Dimensión Educacional

Variable Promedio PSU colegios particular pagados
type: Class
comment: Indica resultados promedio de la prueba PSU en los colegios particular pagados.
subclass of: Variables Dimensión Educacional

Variable Promedio PSU colegios particular subvencionados
type: Class
comment: Indica resultados promedio de la prueba PSU en los colegios particular subvencionados.
subclass of: Variables Dimensión Educacional

Variable de proyección
type: Class
comment: La proyección de población proporciona información que permite establecer escenarios futuros probables respecto de la evolución de la población del país.
subclass of: Variable

Variable SIMCE lenguaje 2° medio
type: Class
comment: Indica resultados de la prueba SIMCE, ámbito lenguaje, de los estudiantes de segundo medio.
subclass of: Variables Dimensión Educacional

VariableSIMCE matemática 2° medio
type: Class
comment: Indica resultados de la prueba SIMCE, ámbito matemática, de los estudiantes de segundo medio.
subclass of: Variables Dimensión Educacional

Variable SIMCE lenguaje 4° básico
type: Class
comment: Indica resultados de la prueba SIMCE, ámbito lenguaje, de los estudiantes de cuarto básico.
subclass of: Variables Dimensión Educacional

Variable SIMCE matemática 4° básico
type: Class
comment: Indica resultados de la prueba SIMCE, ámbito matemática, de los estudiantes de cuarto básico.
subclass of: Variables Dimensión Educacional

Variable SIMCE lenguaje 8° básico
type: Class
comment: Indica resultados de la prueba SIMCE, ámbito lenguaje, de los estudiantes de octavo básico.
subclass of: Variables Dimensión Educacional

VariableSIMCE matemática 8° básico
type: Class
comment: Indica resultados de la prueba SIMCE, ámbito matemática, de los estudiantes de octavo básico.
subclass of: Variables Dimensión Educacional

Variable Inscritos ISAPRES
type: Class
comment: Indica número y porcentaje de personas inscritas en ISAPRES.
subclass of: Variables Dimensión Salud

Variable Inscritos salud privada
type: Class
comment: Indica número y porcentaje de personas inscritas en el sistema de salud privado.
subclass of: Variables Dimensión Salud

Variable Inscritos salud pública
type: Class
comment: Indica número y porcentaje de personas inscritas en el sistema de salud público.
subclass of: Variables Dimensión Salud

Variable Subsidio monetario hogares
type: Class
comment: Indica el monto promedio de los subsidios a los hogares. Este monto indica los aportes en efectivo que distribuye el Estado a las personas y los hogares a través de sus programas sociales. Para 2009, incluye los subsidios percibidos por los hogares por concepto de Pensión Básica Solidaria de Vejez y de Invalidez, Aporte Previsional Solidario de Vejez e Invalidez, Subsidio Único Familiar, Subsidio a la Discapacidad Mental, Bonos de Protección Familiar y Bono de Egreso de Chile Solidario, Bonos Extraordinarios de Apoyo a la Familia (Marzo) / (Agosto), Subsidio al Pago del Consumo de Agua Potable, Alcantarillado y Tratamiento de Aguas Servidas (SAP), Subsidio Eléctrico, Subsidio de Cesantía y Asignación Familiar.
subclass of: Variables Dimensión Social

Variable Tasa de desocupados
type: Class
comment: Indica el número de personas desocupadas, expresado como porcentaje de la fuerza de trabajo en el área de interés.
subclass of: Variables Dimensión Económica

Variable Tasa mortalidad general
type: Class
comment: Indica la tasa de mortalidad general en la pobalción. Tasa: número de defunciones por 1.000 habitantes del área de interés, en un cierto año.
subclass of: Variables Dimensión Salud

Variable Tasa mortalidad infantil
type: Class
comment: Tasa de mortalidad infantil. Tasa: defunciones de menores de 1 año por 1.000 nacidos vivos, en el área de interés, en un cierto año.
subclass of: Variables Dimensión Salud

Variable Tasa natalidad
type: Class
comment: Indica tasa de natalidad. Tasa: número de nacidos vivos por 1.000 habitantes, en el área de interés en un cierto año.
subclass of: Variables Dimensión Salud

Variable Tasa de ocupados
type: Class
comment: Indica número de personas ocupadas como porcentaje de la población en edad de trabajar.
subclass of: Variables Dimensión Económica

Variable Tasa de participación
type: Class
comment: Indica el número de personas en la fuerza de trabajo expresado como porcentaje de la población en edad de trabajar.
subclass of: Variables Dimensión Económica

Variable Trabajadores empresas Administración Pública
type: Class
comment: Indica el número de personas ocupadas en las empresas de la administración pública.
subclass of: Variables Dimensión Económica

Variable Trabajadores empresas agrícolas
type: Class
comment: Indica el número de personas ocupadas en empresas agrícolas.
subclass of: Variables Dimensión Económica

Variable Trabajadores comercio mayor y menor
type: Class
comment: Indica el número de personas ocupadas en empresas de comercio al por mayor y menor.
subclass of: Variables Dimensión Económica

Variable Trabajadores empresas administración edificios
type: Class
comment: Indica el número de personas ocupadas en empresas de la adminstración de edificios.
subclass of: Variables Dimensión Económica

Variable Trabajadores empresas construcción
type: Class
comment: Indica el número de personas ocupadas en empresas de la construcción.
subclass of: Variables Dimensión Económica

Variable Trabajadores empresas enseñanza
type: Class
comment: Indica el número de personas ocupadas en empresas de la rama de la enseñanza.
subclass of: Variables Dimensión Económica

Variable Trabajadores hoteles restaurantes
type: Class
comment: Indica el número de personas ocupadas en hoteles y restaurantes.
subclass of: Variables Dimensión Económica

Variable Trabajadores empresas inmobiliarias
type: Class
comment: Indica el número de personas ocupadas en empresas inmobiliarias.
subclass of: Variables Dimensión Económica

Variable Trabajadores empresas intermediación financiera
type: Class
comment: Indica el número de personas ocupadas en empresas de intermediación financiera.
subclass of: Variables Dimensión Económica

Variable Trabajadores empresas metálicas
type: Class
comment: Indica el número de personas ocupadas en empresas manufactureras metálicas.
subclass of: Variables Dimensión Económica

Variable Trabajadores empresas no metálicas
type: Class
comment: Indica el número de personas ocupadas en empresas mmanufactureras no metálicas.
subclass of: Variables Dimensión Económica

Variable Trabajadores servicios comunitarios
type: Class
comment: Indica número de personas ocupadas en entidades de otras actividades de servicios comunitarios, sociales y personales, aparte de la rama de servicios sociales y de salud.
subclass of: Variables Dimensión Económica

Variable Trabajadores empresas grandes
type: Class
comment: Indica número de persoans ocupadas en emrpesas con ventas anuales de 100.000,01 UF a más de 1.000.000 UF.
subclass of: Variables Dimensión Económica

Variable Trabajadores empresas medianas
type: Class
comment: Indica número de personas ocupadas en empresas con ventas anuales de 25.000,01 UF a 100.000 UF.
subclass of: Variables Dimensión Económica

Variable Trabajadores servicios comunitarios
type: Class
comment: Indica el número de personas ocupadas en entidades de servicio comunitario.
subclass of: Variables Dimensión Económica

Variable Trabajadores servicios sociales y salud
type: Class
comment: Indica el número de personas ocupadas en entidades de servicio social y de salud.
subclass of: Variables Dimensión Económica

Variable Trabajadores empresas sin información
type: Class
comment: Indica el número de persnans ocupadas en empresas sin información.
subclass of: Variables Dimensión Económica

Variable Trabajadores empresas eléctricas
type: Class
comment: Indica el número de personas ocupadas en empresas del suministro de elecricidad.
subclass of: Variables Dimensión Económica

Variable Trabajadores empresas transporte
type: Class
comment: Indica el número de personas ocupadas en empresas de transporte.
subclass of: Variables Dimensión Económica

Variable Trabajadores microempresas
type: Class
comment: Indica el número de personas ocupadas en empresas con ventas anuales de 0,01 UF a 2.400 UF.
subclass of: Variables Dimensión Económica

Variable Trabajadores pequeñas empresas
type: Class
comment: Indica número de personas ocupadas en empresas con ventas anuales de 2.400,01 UF a 25.000 UF.
subclass of: Variables Dimensión Económica

Variable Uniones comunales
type: Class
comment: Indica número de uniones comunales.
subclass of: Variables Dimensión Municipalidad

Variable Viviendas arrendadas
type: Class
comment: Indica número y porcentaje de viviendas arrendadas. Se calcula a partir de la pregunta para los jefes de hogar: “¿Su hogar, bajo qué situación ocupa la vivienda?
subclass of: Variables Dimensión Social

Variable Viviendas cedidas
type: Class
comment: Indica número y porcentaje de viviendas cedidas. Se calcula a partir de la pregunta para los jefes de hogar: “¿Su hogar, bajo qué situación ocupa la vivienda?
subclass of: Variables Dimensión Social

Variable Viviendas en usufructo
type: Class
comment: Indica número y porcentaje de viviendas en usufructo. Se calcula a partir de la pregunta para los jefes de hogar: “¿Su hogar, bajo qué situación ocupa la vivienda?
subclass of: Variables Dimensión Social

Variable Viviendas ocupación irregular
type: Class
comment: Indica número y porcentaje de viviendas en situación de ocupación irregular. Se calcula a partir de la pregunta para los jefes de hogar: “¿Su hogar, bajo qué situación ocupa la vivienda?
subclass of: Variables Dimensión Social

Variable Viviendas pagadas
type: Class
comment: Indica número y porcentaje de viviendas pagadas. Se calcula a partir de la pregunta para los jefes de hogar: “¿Su hogar, bajo qué situación ocupa la vivienda?
subclass of: Variables Dimensión Social

Variable Viviendas pagándose
type: Class
comment: Indica número y porcentaje de viviendas pagándose. Se calcula a partir de la pregunta para los jefes de hogar: ¿Su hogar, bajo qué situación ocupa la vivienda?
subclass of: Variables Dimensión Social

Variable Vivienda tipo casa
type: Class
comment: Indica número y porentaje de vivienda tipo casa. Casa: Individual, en Cité, en Condominio.
subclass of: Variables Dimensión Social

Variable Vivienda departamento
type: Class
comment: Indica número y porentaje de vivienda tipo departamento.
subclass of: Variables Dimensión Social

Variable Vivienda pieza
type: Class
comment: Indica número y porentaje de vivienda tipo pieza.
subclass of: Variables Dimensión Social