Ontología de Recursos Legislativos
type: Ontology
version IRI: bcn-resources.rdf
imports: bcn-biographies#
comment: La Ontología de recursos legislativos de la BCN entrega un modelo de clases y propiedades que modelan la estructura jerarquía de los principales recursos referenciables en el Congreso Nacional (tales como documentos y relaciones con actores).
version info: 1.2

tiene documento
type: ObjectProperty
domain: Recurso legislativo
range: Documento
comment: Enlaza un recurso legislativo con un recurso (documento) representado por una URI sintética desde la cual se referenciará tanto la información de la ficha FRBR como la URI del documento real.

tiene seccion recurso
type: ObjectProperty
domain: Recurso legislativo
range: SeccionRecurso
label: has resource section @en

convertido a
type: ObjectProperty
comment: Permite mantener la trazabilidad entre una entidad temporal y una entidad existente a la cual fue atribuida

creada por
type: ObjectProperty
domain: Tramitación de proyecto de ley
range: FormalOrganization
comment: Enlaza una tramitación de proyecto de ley con la organización creadora

es parte de
type: ObjectProperty
comment: Permite enlazar dos recursos mediante una relación de inclusión S es parte de O
label: is part of @en

estado
type: ObjectProperty
deprecated: true

extraído desde
type: ObjectProperty
comment: Vincula un documento o una sección del documento con su origen
label: extracted from @en

extraído desde entidad temporal
type: ObjectProperty
domain: Person
range: Entidad temporal
comment: Relaciona una entidad de tipo persona con su origen en una entidad temporal
deprecated: true

fuente documento
type: ObjectProperty
range: FormalOrganization
comment: Asocia un documento con la oficina de origen de este
label: document source @en

tiene expresión
type: ObjectProperty
domain: Ficha FRBR
range: Expresión
label: has expression @en

tiene manifestación
type: ObjectProperty
domain: Ficha FRBR
range: Manifestación
label: has manifestation @en

tiene trabajo
type: ObjectProperty
domain: Ficha FRBR
range: Trabajo
label: has work @en

incluído en
type: ObjectProperty
domain: Document
comment: Relaciona un documento con la sección de otro documento donde está incluído de fuente
label: included in @en

pertenece A
type: ObjectProperty
domain: Tipo de documento
comment: Permite relacionar una sección de un documento a un tipo de documento Akoma Ntoso [Editor XML]
label: belongs to @en

tiene adhesión
type: ObjectProperty
domain: Sección recurso
range: Person
comment: Indica si una sección de intervención de un documento presenta adhesiones de algún parlamentario
label: has adhesion @en

tiene autor
type: ObjectProperty
comment: Asocia un documento con su o sus autores/as
label: has author @en

tiene comisión
type: ObjectProperty
domain: Document
range: FormalOrganization
comment: Relaciona un documento con una comisión parlamentaria
label: has commission @en

tiene datos temporales
type: ObjectProperty
comment: Relaciona un recurso con algún dato temporal que debe ser corroborado
deprecated: true

tiene documento Akoma Ntoso
type: ObjectProperty
sub property of: tiene documento
comment: Enlaza un recurso con su representación en formato AkomaNtoso XML
label: has Akoma Ntoso document @en

tiene documento de texto
type: ObjectProperty
sub property of: tiene documento
comment: Enlaza un recurso con su representación en formato TXT
label: has text document @en

tiene emisor
type: ObjectProperty
comment: Relaciona un documento o una sección con una entidad que emite dicho mensaje
label: has transmitter @en

tiene etiqueta XML
type: ObjectProperty
comment: Relaciona una URI de una sección recurso con una URI que representa una etiqueta XML [Editor XML]
label: has XML tag @en

tiene ficha FRBR
type: ObjectProperty
domain: Documento
range: Ficha FRBR
label: has frbr card @en

tiene iniciativa
type: ObjectProperty
domain: Proyecto de ley
comment: Describe el tipo de iniciativa que ha tenido un documento, preferentemente un proyecto de ley (moción o mensaje presidencial)
label: initiative type @en

tiene ítem
type: ObjectProperty
domain: Ficha FRBR
range: Ítem
label: has item @en

tiene materia
type: ObjectProperty
range: subject
comment: Asocia un recurso a un metadato normalizado de tipo materia
label: has subject @en

tiene persona
type: ObjectProperty
domain: Asistente
range: Person
comment: Enlaza una entidad de asistncia con una persona
label: has person @en

tiene proyecto de ley
type: ObjectProperty
range: Proyecto de ley
comment: Relaciona un documento o una sección de un documento con un proyecto de ley
label: has bill @en

tiene receptor
type: ObjectProperty
comment: Relaciona un documento o una parte de un documento con una entidad a la cual está dirigida
label: has receiver @en

tiene referencia
type: ObjectProperty
label: has reference @en

tiene resultado debate
type: ObjectProperty
range: Resultado del debate
comment: Enlaza un debate con su resultado en caso de tenerlo
label: has debate result @en

tiene resultado votación
type: ObjectProperty
domain: Sección recurso
range: Resultado
comment: Relaciona una votación con su resultado
label: has voting result @en

tiene sesión parlamentaria
type: ObjectProperty
domain: Tramitación de proyecto de ley
domain: Document
range: SesionParlamentaria
comment: Enlaza un recurso con una sesión parlamentaria
label: has parliamentary session @en

tiene tipo documento
type: ObjectProperty
domain: Documento
range: Tipo de documento
label: has document type @en

tiene tipo participacion
type: ObjectProperty
domain: Participación
range: Tipo de participación
comment: Relaciona una participación parlamentaria con su tipo
label: has speech type @en

tiene tramitación
type: ObjectProperty
domain: Proyecto de ley
range: Tramitación de proyecto de ley
comment: Asocia un documento con la tramitación de un proyecto de ley a la cual está relacionada o donde fue presentado
label: has processing @en

tiene trámite constitucional
type: ObjectProperty
range: Trámite constitucional
comment: Enlaza un documento o proyecto de ley a un trámite constitucional específico
label: has constitutional procedure @en

tiene trámite reglamentario
type: ObjectProperty
range: Trámite reglamentario
comment: Enlaza un documento o proyecto de ley a un trámite reglamentario específico
label: has regulatory procedure @en

tiene trazablidad
type: ObjectProperty
comment: Indica el origen desde donde surge cierto nuevo recurso
deprecated: true

tiene votación
type: ObjectProperty
domain: Proyecto de ley
range: Votación
comment: Vincula cada una de las votaciones de un proyecto de ley a su proyecto respectivo
label: has voting @en

tiene voto
type: ObjectProperty
domain: Votación
range: Voto
comment: Vincula con la votación a cada voto emitido
label: has vote @en

tipo proyecto
type: ObjectProperty
domain: Proyecto de ley
range: Tipo proyecto de ley
comment: Asocia un proyecto de ley con su tipo
label: has bill type @en

tipo votación
type: ObjectProperty
domain: Votación
range: Tipo votación
comment: Vincula para cada votación el tipo al cual está asociado
label: has voting type @en

valor voto
type: ObjectProperty
domain: Voto
range: Valor voto
comment: Vincula al voto con su valor
label: vote value @en

votante
type: ObjectProperty
domain: Voto
range: Person
comment: Vincula al voto con la persona que lo emite
label: voter @en

fecha de creación
type: DatatypeProperty
domain: Thing
range: string
comment: Indica la fecha de creción en formato YYYY-MM-DD
label: creation date @en

creada por workflow
type: DatatypeProperty
comment: Indica si una sesión o legislatura ha sido creada por el worwflow de procesamiento
label: created by workflow @en

descripción en XML
type: DatatypeProperty
domain: Sección recurso
comment: Entrega la descripción en XML de una sección de documento Akoma Ntoso
label: xml description @en

id en editor XML
type: DatatypeProperty
comment: Establece un id de tipo texto para recursos referenciados desde diversas marcas en un editor XML
label: editor id @en

metadato genérico
type: DatatypeProperty
comment: Permite generar metadatos para uso exclusivo el editor XML [Editor XML]
label: generic metadata @en

acrónimo en el NER
type: DatatypeProperty
domain: Class
  union of: Role
  union of: Evento
  union of: Proyecto de ley
  union of: Place
  union of: TemporalEntity
  union of: FormalOrganization
  union of: Document
  union of: Person
range: string
comment: Acrónimo en el NER (marcador automático de entidades)
comment: has ner acronym @en

número
type: DatatypeProperty
comment: Asocia un número (string) identificatorio a un recurso en diversos contextos
label: number @en

obsoleto
type: DatatypeProperty
domain: Caducable
range: boolean
label: deprecated @en

id temporal
type: DatatypeProperty
comment: Relaciona un recurso con un id temporal
deprecated: true

tiene atributo name
type: DatatypeProperty
comment: Relaciona una URI de un recurso con una etiqueta en XML con la cual es marcada en los documentos Akoma Ntoso [Editor XML]
label: has name attribute @en

tiene fin
type: DatatypeProperty
comment: Establece una hora de fin de un evento específico
label: has end @en

tiene inicio
type: DatatypeProperty
comment: Establece una hora de inicio de un evento específico
label: has init @en

tiene path XML
type: DatatypeProperty
domain: Document
comment: Describe en sintaxis XPATH la ubicación de una sección dentro de un documento XML
label: has XML path @en

tiene término libre
type: DatatypeProperty
comment: Asocia un recurso a un metadato de texto denominado término libre
label: has keyword @en

tiene URI
type: DatatypeProperty
domain: Documento
range: anyURI
label: has URI @en

total de pareos
type: DatatypeProperty
domain: Person
comment: Indica el número de pareos en la votación
label: total of agree abstention @en

total parlamentarios pareados
type: DatatypeProperty
domain: Person
comment: Indica el número de votantes optaron por pareo en la votación
label: total parliamentarians in abstention agree @en

total de votos a favor
type: DatatypeProperty
domain: Person
comment: Indica el número de votantes que votaron a favor en la votación
label: total pro @en

total de votos en contra
type: DatatypeProperty
domain: Person
comment: Indica el número de votantes que votaron en contra en la votación
label: total cons @en

total de votos de abstención
type: DatatypeProperty
domain: Person
comment: Indica el número de votantes que se abstuvieron en la votación
label: total abstention @en

Tipo proyecto de ley
type: Class
label: Bill type @en

Trámite constitucional
type: Class
label: Constitutional procedure @en

Trámite reglamentario
type: Class
label: Regulatory procedure @en

Role
type: Class

Recurso legislativo
type: Class
subclass of: Relacionable
comment: Clase de alto nivel que permite agrupar diferentes recursos referenciables desde todo el grafo RDF. Adicionalmente cuenta con una propiedad no especificada denominada tieneAtributo que agrupa todas las DatatypeProperties

Acuerdos de comité
type: Class
label: Committee agreements @en

Agrupador semántico
type: Class
label: Semantic grouper @en

Artículo
type: Class
comment: One of the basic normative unit of the law @en
comment: Una de las unidades básicas formativas de la ley
label: Article @en

Caducable
type: Class
comment: Los recursos que tengan este tipo podrán tener estado de obsoleto o no obsoleto.
comment: Resources with this class could be obsolete @en
label: Deprecable @en

Categoría
type: Class
comment: Utilizado para trabajo en el [Editor XML]
label: Category @en

Account
type: Class
subclass of: RecursoLegislativo

Diario de sesión
type: Class
subclass of: RecursoLegislativo
comment: Publicación oficial que recoge el debate de las sesiones de sala de cada una de las cámaras, y que se divide fundamentalmente en dos partes: debate en sala y anexo documentos. En el primero, consta el debate en sala propiamente tal, y en el segundo los documentos de que se da cuenta en la sesión respectiva, por ejemplo: los informes evacuados por las Comisiones, los oficios producidos en el proceso legislativo, oficios enviados por órganos externos al Congreso Nacional, informes de comisión investigadora, etc. Se publica un Diario por cada sesión.
label: Session daily @en

Discusión en sala
type: Class
subclass of: RecursoLegislativo
label: Session room discussion @en

Discusión general
type: Class
subclass of: Discusión en sala
label: General discussion @en

Discusión informe comisión mixta
type: Class
subclass of: Discusión en sala
label: Discussion on mixed commission report @en

Discusión insistencia
type: Class
subclass of: Discusión en sala
label: Discussion insistence @en

Discusión observaciones (veto)
type: Class
subclass of: Discusión en sala
label: Discussion observations @en

Discusión otra materia
type: Class
subclass of: Discusión en sala
label: Discussion another subject @en

Discusión particular
type: Class
subclass of: Discusión en sala
label: Particular discussion @en

Discusión única
type: Class
subclass of: Discusión en sala
label: Unique discussion @en

Documento
type: Class
subclass of: Document
label: Document @en

Documento bitácora
type: Class
subclass of: Documento
label: Generic Document for bill processing @en

Enmiendas versión proyecto de ley
type: Class
subclass of: Documento
label: Ammendments of bill version @en

Entidad temporal
type: Class
label: Temporal entity @en

Ficha FRBR
type: Class
label: FRBR card @en

Informe
type: Class
subclass of: Documento
subclass of: Relacionable
label: Report @en

Informe comisión mixta
type: Class
subclass of: Informe de comisión
label: Report mixed commission @en

Informe complementario
type: Class
subclass of: Informe de comisión
label: Complementary report @en

Informe de comisión
type: Class
subclass of: Informe
label: Debate report @en

Informe de diplomacia parlamentaria
type: Class
subclass of: Informe de comisión
label: Parliamentary diplomacy report @en

Informe insistencia
type: Class
subclass of: Informe de comisión
label: Insistence report @en

Informe modificación
type: Class
subclass of: Informe de comisión
label: Modificacion report @en

Informe observaciones (veto)
type: Class
subclass of: Informe de comisión
label: Observations report @en

Iniciativa legal
type: Class
subclass of: RecursoLegislativo
type: NamedIndividual
label: Legal initiative @en

Mensaje
type: Class
subclass of: Iniciativa legal
type: NamedIndividual
comment: Legal initiative of bill presented by the president (executive power)
label: Message @en
comment: Iniciativa legal de proyecto de ley presentada por el presidente de la república

Mensaje del ejecutivo refundido
type: Class
subclass of: Mensaje
label: Message of executive power fusioned @en

Moción Parlamentaria
type: Class
subclass of: Iniciativa legal
label: Parliamentary bill @en

Nuevo primer informe
type: Class
subclass of: Informe de comisión
label: New first report @en

Nuevo segundo informe
type: Class
subclass of: Informe de comisión
label: New second report @en

Oficio
type: Class
subclass of: RecursoLegislativo
label: Legal document @en

Origen documento
type: Class
comment: Establece que un recurso RDF es origen de documentos, es decir, se generan por él.
label: Document source @en

Participación
type: Class
label: Speech @en

Petición de oficio
type: Class
subclass of: Documento
label: Officio petition @en

Primer informe
type: Class
subclass of: Informe de comisión
label: First report @en

Proyecto de acuerdo
type: Class
subclass of: Documento
label: Draft agreement @en

Proyecto de ley
type: Class
subclass of: Class
  one of: Iniciativa legal
  one of: Mensaje
label: Bill @en

Proyecto de ley antiguo
type: Class
subclass of: Proyecto de ley
label: Old bill @en

Proyecto de ley junta militar
type: Class
subclass of: Proyecto de ley
label: Bill of militar government @en

Ratificación reforma constitucional
type: Class
subclass of: Discusión en sala
label: Ratification constitutional reform @en

Referenciable
type: Class

Relacionable
type: Class
comment: Esta clase permite identificar recursos de cualquier tipo que puedan tener una relación (de tipo Metadato) con otro tipo de elemento.
label: Relatable @en

Resultado del debate
type: Class
label: Debate result @en

Resultado
type: Class
label: Result @en

Resumen
type: Class
subclass of: RecursoLegislativo
label: Summary @en

Sección recurso
type: Class
label: Resource section @en

Segundo informe
type: Class
subclass of: Informe de comisión
label: Second report @en

Tipo de documento
type: Class
label: Document type @en

Tipo de participación
type: Class
label: Speech type @en

Tipo votación
type: Class
label: Voting type @en

Tramitación de proyecto de ley
type: Class
label: Bill processing @en

Unidad básica normativa
type: Class
subclass of: RecursoLegislativo
label: Basic normative unit for laws @en

Versión proyecto de ley
type: Class
subclass of: Documento
label: Bill version @en

Votación
type: Class
label: Voting @en

Voto
type: Class
label: Vote @en

Valor voto
type: Class
label: Vote value @en

Expresión
type: Class
label: Expression @en

Ítem
type: Class
label: Item @en

Manifestación
type: Class
label: Manifestation @en

Trabajo
type: Class
label: Work @en

Person
type: Class

Position

Position period

total votes

Commission

Writting office

Periodo legislativo
label: Legislative period @en

Sesión pública
label: Public session @en

Boletín de indicaciones
label: Directions bulletin @en

Comunicación
label: Communication @en

Informe de comisión investigadora
label: Investigative commission report @en

Informe de comisión legislativa
label: Legislative commission report @en

Informe delegación parlamentaria
label: Parliamentary delegation report @en

tiene calidad (similar a tiene rol)
deprecated: true

Informe
label: Report @en